program: Orca
programVersion: 4.2.1
elementType: S O O O N N N N C C C C C C C C C C C C C H H H H H H H H H H H H H H H H H H H H H H H H
charge: 0
multiplicity: 1
keywords: wb97x-d3
keywords: def2-TZVPP
keywords: def2/J RIJCOSX GRIDX6 NOFINALGRIDX
keywords: grid4 nofinalgrid
keywords: scfconv7
keywords: smallprint printgap noloewdin
keywords: NOSOSCF
formula: C13H24N4O3S
InChI: InChI=1/C13H24N4O3S/c1-6-8-9-11-10(3)15-13(14-7-2)16-12(11)20-21(18,19)17(4)5/h14H,6-9H2,1-5H3
45 atoms
S  -1.589529 -1.466005 -0.160898
O  -0.183881 -1.033237 0.575837
O  -1.625858 -2.871796 0.159419
O  -1.555923 -1.03325 -1.535344
N  1.896933 2.366851 -0.058132
N  -0.136895 1.160106 -0.098316
N  -2.810984 -0.74592 0.627477
N  -0.004834 3.333504 -0.863233
C  2.640211 -1.204918 0.896924
C  3.300876 -1.880508 -0.313085
C  1.893012 0.046111 0.5319
C  2.330633 -2.484493 -1.323296
C  2.532238 1.283367 0.362156
C  0.526021 0.104201 0.302016
C  1.636388 -3.741815 -0.822084
C  0.589988 2.257566 -0.320625
C  3.988181 1.438231 0.662995
C  -1.421387 3.466042 -1.108261
C  -2.883929 -0.985506 2.067088
C  -3.27311 0.576014 0.223249
C  -2.192955 4.047808 0.063884
H  1.98414 -1.912028 1.405746
H  3.418191 -0.958756 1.622692
H  3.969548 -2.665997 0.051814
H  3.941242 -1.154143 -0.82074
H  1.589729 -1.738418 -1.625998
H  2.885123 -2.72832 -2.23304
H  0.923699 -4.119682 -1.555958
H  2.362684 -4.534356 -0.631294
H  1.087561 -3.571994 0.10333
H  4.212849 1.144162 1.689223
H  4.299247 2.470663 0.526275
H  4.600012 0.810629 0.014014
H  0.558048 4.166987 -0.910063
H  -1.545842 4.106164 -1.981565
H  -1.817793 2.491178 -1.382858
H  -3.907078 -0.795506 2.382871
H  -2.220059 -0.322947 2.625368
H  -2.651367 -2.017233 2.31205
H  -3.228257 0.694604 -0.853528
H  -4.316055 0.655479 0.523785
H  -2.705562 1.369903 0.702645
H  -3.260567 4.06655 -0.158289
H  -1.877221 5.070483 0.27335
H  -2.047972 3.461014 0.971294
elementType: S O N C H
totalener: -1352.85076682 hartree
nucrepener: 2116.51431821 hartree
electener: -3469.36508503 hartree
oneelecener: -6057.95868896 hartree
twoeener: 2588.59360393 hartree
cpcmener: -0.03110869 hartree
kineticenergy: 1347.71885231 hartree
xcener: -110.808254976378 hartree
chargesum: -0.0000000
charge: 0.923482 -0.299794 -0.511500 -0.496610 -0.398077 -0.385912 -0.149843 -0.204554 -0.133133 -0.142042 -0.162069 -0.102549 0.160845 0.333022 -0.284997 0.385017 -0.282204 -0.007990 -0.177737 -0.201208 -0.290327 0.095278 0.104411 0.075238 0.086694 0.049952 0.079115 0.092187 0.089741 0.067952 0.108526 0.097088 0.112188 0.164088 0.106641 0.087343 0.116367 0.116162 0.124317 0.126562 0.132897 0.112927 0.097815 0.098131 0.086557
qa: 0.9235 -0.2998 -0.5115 -0.4966 -0.3981 -0.3859 -0.1498 -0.2046 -0.1331 -0.1420 -0.1621 -0.1025 0.1608 0.3330 -0.2850 0.3850 -0.2822 -0.0080 -0.1777 -0.2012 -0.2903 0.0953 0.1044 0.0752 0.0867 0.0500 0.0791 0.0922 0.0897 0.0680 0.1085 0.0971 0.1122 0.1641 0.1066 0.0873 0.1164 0.1162 0.1243 0.1266 0.1329 0.1129 0.0978 0.0981 0.0866
va: 6.0114 2.0628 1.9877 1.9808 3.0408 2.9535 3.0742 3.1563 3.8329 3.8790 3.6708 3.8529 3.9259 4.0110 3.9174 4.1987 3.9371 3.8516 3.8916 3.9098 3.9249 1.0134 1.0055 1.0113 1.0101 1.0212 1.0070 1.0050 1.0048 1.0124 0.9980 1.0238 0.9963 1.0241 0.9995 1.0092 0.9932 0.9939 1.0095 1.0034 0.9969 0.9884 1.0042 1.0051 0.9972
dispcorr: -0.025647131 hartree
energy: -1352.876413949541
dipole: 5.65786 -5.94912 -0.29126 3.83358 -1.48899 2.34458 3.25867 -1.75845 1.50022
magnitude: 2.79867 au
magnitude: 7.11366 debye
