program: Orca
programVersion: 4.2.1
elementType: S O O O N N N N C C C C C C C C C C C C C H H H H H H H H H H H H H H H H H H H H H H H H
charge: 0
multiplicity: 1
keywords: wb97x-d3
keywords: def2-TZVPP
keywords: def2/J RIJCOSX GRIDX6 NOFINALGRIDX
keywords: grid4 nofinalgrid
keywords: scfconv7
keywords: smallprint printgap noloewdin
keywords: NOSOSCF
formula: C13H24N4O3S
InChI: InChI=1/C13H24N4O3S/c1-6-8-9-11-10(3)15-13(14-7-2)16-12(11)20-21(18,19)17(4)5/h14H,6-9H2,1-5H3
45 atoms
S  -2.192973 -0.441629 0.017367
O  -0.57671 -0.667808 -0.184364
O  -2.655811 0.431747 -1.03131
O  -2.437915 -0.127962 1.402027
N  2.057509 2.377981 0.058856
N  -0.134107 1.521453 0.299651
N  -2.703928 -1.957788 -0.282022
N  0.344414 3.707611 0.799251
C  2.076416 -1.287895 -0.87625
C  2.370455 -2.20315 0.313794
C  1.624427 0.080449 -0.460181
C  2.838754 -3.587988 -0.11088
C  2.477785 1.182856 -0.338132
C  0.313948 0.363393 -0.105043
C  3.089222 -4.508784 1.073126
C  0.763179 2.50683 0.36504
C  3.930517 1.054921 -0.666315
C  -1.045647 4.042692 1.021517
C  -2.577532 -2.430904 -1.660102
C  -2.352712 -2.97434 0.709179
C  -1.853584 4.245693 -0.249074
H  2.971221 -1.206062 -1.496617
H  1.321006 -1.756574 -1.512031
H  1.471746 -2.297059 0.931372
H  3.130095 -1.738714 0.951102
H  2.09001 -4.036558 -0.771002
H  3.752387 -3.495664 -0.705591
H  3.431186 -5.493099 0.751022
H  3.84954 -4.099379 1.740882
H  2.180627 -4.653039 1.660704
H  4.397305 0.249456 -0.097607
H  4.457391 1.980142 -0.447116
H  4.074989 0.823009 -1.722979
H  1.007889 4.460989 0.728927
H  -1.505774 3.266304 1.631952
H  -1.056458 4.95416 1.617455
H  -1.558116 -2.739054 -1.901826
H  -2.902532 -1.675452 -2.368301
H  -3.233121 -3.290842 -1.773894
H  -2.519701 -2.615816 1.719845
H  -3.008216 -3.827452 0.551151
H  -1.318367 -3.31124 0.610655
H  -1.896085 3.332824 -0.842186
H  -1.43321 5.040816 -0.865577
H  -2.877462 4.525521 0.002555
elementType: S O N C H
totalener: -1352.85557912 hartree
nucrepener: 2058.99908626 hartree
electener: -3411.85466538 hartree
oneelecener: -5943.05785355 hartree
twoeener: 2531.20318817 hartree
cpcmener: -0.03150339 hartree
kineticenergy: 1347.72359390 hartree
xcener: -110.801382218697 hartree
chargesum: -0.0000000
charge: 0.923570 -0.273766 -0.495559 -0.498768 -0.398425 -0.395054 -0.175856 -0.222706 -0.117002 -0.120614 -0.184429 -0.090335 0.177033 0.339971 -0.277449 0.383222 -0.280862 0.027167 -0.179619 -0.179506 -0.271874 0.093960 0.088605 0.068441 0.072967 0.057546 0.062617 0.091728 0.079232 0.077702 0.108113 0.096182 0.112307 0.167537 0.073076 0.098552 0.112229 0.124383 0.116969 0.124208 0.118104 0.110885 0.081912 0.084623 0.088984
qa: 0.9236 -0.2738 -0.4956 -0.4988 -0.3984 -0.3951 -0.1759 -0.2227 -0.1170 -0.1206 -0.1844 -0.0903 0.1770 0.3400 -0.2774 0.3832 -0.2809 0.0272 -0.1796 -0.1795 -0.2719 0.0940 0.0886 0.0684 0.0730 0.0575 0.0626 0.0917 0.0792 0.0777 0.1081 0.0962 0.1123 0.1675 0.0731 0.0986 0.1122 0.1244 0.1170 0.1242 0.1181 0.1109 0.0819 0.0846 0.0890
va: 6.0112 2.1262 1.9943 1.9886 3.0449 2.9553 3.0693 3.1617 3.8135 3.8137 3.6839 3.8610 3.9039 4.0457 3.9453 4.2020 3.9421 3.8488 3.9000 3.9025 3.9083 1.0054 1.0158 1.0147 1.0149 1.0077 1.0085 1.0041 1.0003 1.0008 0.9943 1.0240 0.9954 1.0219 1.0175 0.9975 0.9931 1.0092 0.9938 1.0092 0.9939 0.9915 1.0125 1.0077 1.0073
dispcorr: -0.022088309 hartree
energy: -1352.877667427397
dipole: 14.75659 -13.68128 1.07531 -16.41681 14.54710 -1.86971 -1.66989 0.91268 -0.75721
magnitude: 2.28593 au
magnitude: 5.81037 debye
