program: Orca
programVersion: 4.2.1
elementType: S O O O N N N N C C C C C C C C C C C C C H H H H H H H H H H H H H H H H H H H H H H H H
charge: 0
multiplicity: 1
keywords: wb97x-d3
keywords: def2-TZVPP
keywords: def2/J RIJCOSX GRIDX6 NOFINALGRIDX
keywords: grid4 nofinalgrid
keywords: scfconv7
keywords: smallprint printgap noloewdin
keywords: NOSOSCF
formula: C13H24N4O3S
InChI: InChI=1/C13H24N4O3S/c1-6-8-9-11-10(3)15-13(14-7-2)16-12(11)20-21(18,19)17(4)5/h14H,6-9H2,1-5H3
45 atoms
S  -1.860391 -1.162533 1.178283
O  -0.219403 -1.035852 1.187273
O  -2.446223 -0.118352 1.97925
O  -1.993012 -2.538377 1.591918
N  1.87527 2.184254 -0.045767
N  -0.16116 1.186684 0.621463
N  -2.343812 -1.026317 -0.3609
N  -0.031916 3.429964 0.110647
C  2.493899 -1.485546 0.668049
C  2.177323 -2.478511 -0.455102
C  1.833204 -0.144441 0.513852
C  2.603694 -2.017576 -1.841683
C  2.493436 1.018693 0.097566
C  0.480366 0.056811 0.753738
C  2.243007 -3.025746 -2.921652
C  0.566888 2.232114 0.222182
C  3.958333 1.00493 -0.201788
C  -1.452258 3.676982 0.213937
C  -1.743937 -1.940879 -1.328842
C  -2.729125 0.264409 -0.921492
C  -2.128903 3.860199 -1.133488
H  2.205203 -1.931559 1.622519
H  3.575452 -1.352135 0.726107
H  1.106538 -2.701132 -0.461613
H  2.675519 -3.424002 -0.221295
H  2.135343 -1.056409 -2.07462
H  3.683866 -1.842652 -1.852269
H  2.71885 -3.991215 -2.739945
H  1.164409 -3.194504 -2.960651
H  2.557276 -2.685095 -3.908906
H  4.291813 1.988405 -0.52294
H  4.197365 0.288222 -0.98798
H  4.538964 0.717794 0.676265
H  0.541351 4.170811 -0.259792
H  -1.905181 2.854034 0.761919
H  -1.601323 4.573016 0.818677
H  -2.442229 -2.05512 -2.155103
H  -1.579273 -2.925337 -0.901712
H  -0.804402 -1.550369 -1.726846
H  -3.524334 0.082404 -1.642622
H  -3.115667 0.92845 -0.156962
H  -1.895452 0.744456 -1.431152
H  -1.720308 4.719084 -1.667678
H  -3.197308 4.032103 -0.997827
H  -2.006612 2.982894 -1.76897
elementType: S O N C H
totalener: -1352.85131792 hartree
nucrepener: 2110.41266941 hartree
electener: -3463.26398733 hartree
oneelecener: -6044.87425669 hartree
twoeener: 2581.61026936 hartree
cpcmener: -0.03326874 hartree
kineticenergy: 1347.71664752 hartree
xcener: -110.808284793841 hartree
chargesum: -0.0000000
charge: 0.885138 -0.277315 -0.483933 -0.510832 -0.399215 -0.386352 -0.148137 -0.194589 -0.106246 -0.145007 -0.178493 -0.118416 0.188875 0.302019 -0.280776 0.385667 -0.289549 -0.014155 -0.195946 -0.193216 -0.269062 0.095314 0.094503 0.066387 0.085913 0.074041 0.070088 0.083467 0.074895 0.092106 0.097213 0.119024 0.110907 0.161329 0.087941 0.102198 0.134000 0.131631 0.104761 0.135544 0.129521 0.109035 0.095913 0.094382 0.079426
qa: 0.8851 -0.2773 -0.4839 -0.5108 -0.3992 -0.3864 -0.1481 -0.1946 -0.1062 -0.1450 -0.1785 -0.1184 0.1889 0.3020 -0.2808 0.3857 -0.2895 -0.0142 -0.1959 -0.1932 -0.2691 0.0953 0.0945 0.0664 0.0859 0.0740 0.0701 0.0835 0.0749 0.0921 0.0972 0.1190 0.1109 0.1613 0.0879 0.1022 0.1340 0.1316 0.1048 0.1355 0.1295 0.1090 0.0959 0.0944 0.0794
va: 6.0727 2.0869 1.9929 1.9837 3.0345 2.9482 3.0425 3.1542 3.8200 3.8521 3.6560 3.8604 3.8676 4.0650 3.9589 4.1986 3.9256 3.8549 3.8979 3.9162 3.9300 1.0145 1.0057 1.0098 1.0148 0.9970 1.0039 0.9999 1.0008 1.0036 1.0251 0.9926 0.9944 1.0252 1.0155 0.9991 0.9972 1.0043 0.9898 0.9951 0.9984 0.9841 1.0044 1.0065 1.0047
dispcorr: -0.025776731 hartree
energy: -1352.877094653419
dipole: 11.01246 -10.14619 0.86627 -0.30533 1.44486 1.13953 -23.63011 20.74932 -2.88080
magnitude: 3.21682 au
magnitude: 8.17651 debye
