program: Orca
programVersion: 4.2.1
elementType: S O O O N N N N C C C C C C C C C C C C C H H H H H H H H H H H H H H H H H H H H H H H H
charge: 0
multiplicity: 1
keywords: wb97x-d3
keywords: def2-TZVPP
keywords: def2/J RIJCOSX GRIDX6 NOFINALGRIDX
keywords: grid4 nofinalgrid
keywords: scfconv7
keywords: smallprint printgap noloewdin
keywords: NOSOSCF
formula: C13H24N4O3S
InChI: InChI=1/C13H24N4O3S/c1-6-8-9-11-10(3)15-13(14-7-2)16-12(11)20-21(18,19)17(4)5/h14H,6-9H2,1-5H3
45 atoms
S  -1.691497 -1.36566 -0.71742
O  -0.626704 -0.740223 0.36514
O  -1.695092 -2.768129 -0.390898
O  -1.292018 -0.904604 -2.024119
N  1.840574 2.313122 -0.593842
N  -0.294196 1.481262 -0.00462
N  -3.146074 -0.745694 -0.343359
N  0.059316 3.72581 -0.350405
C  2.062906 -1.442821 -0.273731
C  2.481617 -1.888342 1.128249
C  1.533877 -0.03969 -0.308427
C  3.015768 -3.313763 1.155186
C  2.32878 1.084232 -0.588477
C  0.220772 0.277925 -0.013101
C  3.419325 -3.763731 2.550599
C  0.542582 2.473391 -0.311665
C  3.781073 0.936378 -0.910805
C  -1.286418 4.097646 0.0203
C  -3.431721 0.633183 -0.726336
C  -3.714043 -1.128851 0.945633
C  -1.523605 4.152078 1.520911
H  2.915123 -1.530162 -0.95108
H  1.316244 -2.139483 -0.66241
H  1.625375 -1.806707 1.804767
H  3.242683 -1.203895 1.517538
H  2.25459 -3.992704 0.758411
H  3.874733 -3.393501 0.481533
H  3.796983 -4.787438 2.547327
H  4.204151 -3.126618 2.963644
H  2.573053 -3.729869 3.239796
H  3.9221 0.38864 -1.844712
H  4.310513 0.38306 -0.133736
H  4.248248 1.912757 -1.017336
H  0.735728 4.456921 -0.495092
H  -1.475592 5.07638 -0.420236
H  -1.989807 3.407068 -0.446175
H  -3.02784 0.861995 -1.707686
H  -3.040628 1.347417 -0.000242
H  -4.513924 0.738466 -0.779905
H  -3.297839 -0.544221 1.769689
H  -4.786375 -0.948719 0.901303
H  -3.567088 -2.18629 1.144931
H  -1.380803 3.175239 1.983484
H  -2.54552 4.472942 1.729359
H  -0.847602 4.860899 2.001488
elementType: S O N C H
totalener: -1352.85968094 hartree
nucrepener: 2063.16793502 hartree
electener: -3416.02761596 hartree
oneelecener: -5951.19269038 hartree
twoeener: 2535.16507443 hartree
cpcmener: -0.02523351 hartree
kineticenergy: 1347.71302118 hartree
xcener: -110.797629230911 hartree
chargesum: 0.0000000
charge: 0.900266 -0.324692 -0.492619 -0.485665 -0.384416 -0.363555 -0.161042 -0.211338 -0.127668 -0.103160 -0.141990 -0.091574 0.165639 0.300306 -0.277641 0.409435 -0.283752 -0.013380 -0.202290 -0.177232 -0.266418 0.095838 0.077857 0.073551 0.065728 0.059340 0.059513 0.090756 0.077979 0.079492 0.110813 0.108155 0.098686 0.164013 0.103466 0.085665 0.130417 0.109013 0.126077 0.115183 0.113091 0.125530 0.085439 0.089675 0.087509
qa: 0.9003 -0.3247 -0.4926 -0.4857 -0.3844 -0.3636 -0.1610 -0.2113 -0.1277 -0.1032 -0.1420 -0.0916 0.1656 0.3003 -0.2776 0.4094 -0.2838 -0.0134 -0.2023 -0.1772 -0.2664 0.0958 0.0779 0.0736 0.0657 0.0593 0.0595 0.0908 0.0780 0.0795 0.1108 0.1082 0.0987 0.1640 0.1035 0.0857 0.1304 0.1090 0.1261 0.1152 0.1131 0.1255 0.0854 0.0897 0.0875
va: 6.0513 2.0157 2.0104 1.9949 3.0540 2.9907 3.0660 3.1499 3.8241 3.8093 3.7216 3.8695 3.9088 4.0842 3.9466 4.1458 3.9408 3.8800 3.9036 3.8928 3.8881 1.0053 1.0344 1.0181 1.0134 1.0075 1.0077 1.0039 1.0005 1.0007 0.9960 0.9938 1.0233 1.0253 0.9987 1.0033 1.0061 0.9930 0.9962 0.9941 0.9925 1.0092 1.0115 1.0077 1.0077
dispcorr: -0.022704081 hartree
energy: -1352.882385021012
dipole: 8.84149 -9.43967 -0.59818 1.08845 0.87938 1.96783 14.12666 -13.05672 1.06994
magnitude: 2.31840 au
magnitude: 5.89289 debye
