program: Orca
programVersion: 4.2.1
elementType: S O O O N N N N C C C C C C C C C C C C C H H H H H H H H H H H H H H H H H H H H H H H H
charge: 0
multiplicity: 1
keywords: wb97x-d3
keywords: def2-TZVPP
keywords: def2/J RIJCOSX GRIDX6 NOFINALGRIDX
keywords: grid4 nofinalgrid
keywords: scfconv7
keywords: smallprint printgap noloewdin
keywords: NOSOSCF
formula: C13H24N4O3S
InChI: InChI=1/C13H24N4O3S/c1-6-8-9-11-10(3)15-13(14-7-2)16-12(11)20-21(18,19)17(4)5/h14H,6-9H2,1-5H3
45 atoms
S  -1.5360 -1.405136 0.297946
O  -0.604165 -0.604326 -0.791001
O  -1.164861 -0.937078 1.610293
O  -1.378291 -2.78648 -0.076785
N  1.872901 2.401612 0.280278
N  -0.291169 1.56384 -0.178007
N  -3.061004 -0.951506 -0.026276
N  0.040072 3.759378 0.422538
C  2.150858 -1.285709 -0.497222
C  2.270035 -2.092919 0.80257
C  1.602449 0.095347 -0.285643
C  2.440663 -3.589996 0.569856
C  2.391407 1.205698 0.058691
C  0.25397 0.390914 -0.381266
C  3.680681 -3.96411 -0.228264
C  0.547017 2.542284 0.164216
C  3.875395 1.082238 0.187496
C  -1.341532 4.13171 0.228103
C  -3.472889 0.385966 0.385195
C  -3.631443 -1.39617 -1.294028
C  -1.681721 4.493792 -1.208979
H  3.126153 -1.221398 -0.984037
H  1.509971 -1.829184 -1.195248
H  1.377841 -1.934641 1.41224
H  3.107113 -1.711945 1.396448
H  2.472741 -4.092278 1.540511
H  1.548369 -3.970664 0.062763
H  3.778069 -5.047522 -0.315853
H  3.654413 -3.563776 -1.243142
H  4.589868 -3.591737 0.249033
H  4.314369 2.038043 0.464615
H  4.327059 0.75682 -0.751546
H  4.150464 0.346086 0.944198
H  0.713378 4.490139 0.584808
H  -1.979163 3.316794 0.57052
H  -1.541374 4.980191 0.882837
H  -3.113779 0.615289 1.383847
H  -4.56071 0.395151 0.415038
H  -3.131838 1.157598 -0.307549
H  -3.394805 -2.438189 -1.487955
H  -4.713684 -1.314387 -1.214851
H  -3.298378 -0.786091 -2.137065
H  -1.074225 5.329342 -1.560375
H  -2.729489 4.787638 -1.288577
H  -1.520406 3.64953 -1.880137
elementType: S O N C H
totalener: -1352.85757462 hartree
nucrepener: 2078.15810680 hartree
electener: -3431.01568142 hartree
oneelecener: -5981.42309653 hartree
twoeener: 2550.40741511 hartree
cpcmener: -0.02446901 hartree
kineticenergy: 1347.70974998 hartree
xcener: -110.798512619057 hartree
chargesum: 0.0000000
charge: 0.911838 -0.323369 -0.484976 -0.489685 -0.383816 -0.362205 -0.168056 -0.214372 -0.152099 -0.131194 -0.133412 -0.109459 0.157909 0.296590 -0.277616 0.407892 -0.283503 0.002111 -0.196032 -0.177618 -0.266020 0.097430 0.098696 0.080429 0.082955 0.069526 0.056355 0.093316 0.079987 0.081322 0.099182 0.109172 0.109661 0.163657 0.080737 0.100081 0.127791 0.123651 0.109656 0.125450 0.111835 0.117351 0.086380 0.088611 0.083861
qa: 0.9118 -0.3234 -0.4850 -0.4897 -0.3838 -0.3622 -0.1681 -0.2144 -0.1521 -0.1312 -0.1334 -0.1095 0.1579 0.2966 -0.2776 0.4079 -0.2835 0.0021 -0.1960 -0.1776 -0.2660 0.0974 0.0987 0.0804 0.0830 0.0695 0.0564 0.0933 0.0800 0.0813 0.0992 0.1092 0.1097 0.1637 0.0807 0.1001 0.1278 0.1237 0.1097 0.1254 0.1118 0.1174 0.0864 0.0886 0.0839
va: 6.0233 2.0219 1.9895 2.0116 3.0512 3.0007 3.0809 3.1541 3.8073 3.8258 3.6895 3.8843 3.9238 4.1079 3.9284 4.1469 3.9344 3.8782 3.9003 3.8922 3.9057 1.0011 1.0173 1.0318 1.0125 1.0081 1.0162 1.0043 0.9994 0.9995 1.0238 0.9969 0.9960 1.0255 1.0052 0.9988 1.0064 0.9970 0.9967 1.0087 0.9936 0.9929 1.0067 1.0078 1.0088
dispcorr: -0.023695873 hartree
energy: -1352.881270495926
dipole: 7.34273 -8.19175 -0.84903 -0.00090 1.76231 1.76141 -4.60004 3.65351 -0.94653
magnitude: 2.17240 au
magnitude: 5.52180 debye
