program: Orca
programVersion: 4.2.1
elementType: S O O O N N N N C C C C C C C C C C C C C H H H H H H H H H H H H H H H H H H H H H H H H
charge: 0
multiplicity: 1
keywords: wb97x-d3
keywords: def2-TZVPP
keywords: def2/J RIJCOSX GRIDX6 NOFINALGRIDX
keywords: grid4 nofinalgrid
keywords: scfconv7
keywords: smallprint printgap noloewdin
keywords: NOSOSCF
formula: C13H24N4O3S
InChI: InChI=1/C13H24N4O3S/c1-6-8-9-11-10(3)15-13(14-7-2)16-12(11)20-21(18,19)17(4)5/h14H,6-9H2,1-5H3
45 atoms
S  -2.243539 -0.462906 -0.027147
O  -0.708671 -0.818472 0.471964
O  -2.153182 0.013243 -1.383051
O  -2.880648 0.312503 1.004117
N  2.123986 2.047724 0.575573
N  -0.134277 1.384329 0.39044
N  -2.874837 -1.955116 -0.027762
N  0.454299 3.59649 0.322855
C  1.937923 -1.740439 0.710864
C  1.837593 -2.481869 -0.628873
C  1.573485 -0.283754 0.633367
C  2.851979 -2.044696 -1.681303
C  2.489284 0.775646 0.678986
C  0.257303 0.143066 0.492862
C  4.265362 -2.543166 -1.415092
C  0.824632 2.310254 0.426158
C  3.95531 0.53099 0.851074
C  -0.89747 4.028952 0.045698
C  -2.445557 -2.884782 -1.065114
C  -3.172809 -2.578971 1.256029
C  -1.316077 3.854825 -1.405413
H  1.288432 -2.240344 1.434122
H  2.946798 -1.844959 1.114158
H  0.828412 -2.361088 -1.029403
H  1.956627 -3.553398 -0.439196
H  2.529136 -2.418539 -2.656504
H  2.846726 -0.953675 -1.770668
H  4.965569 -2.167488 -2.162905
H  4.642886 -2.23599 -0.438034
H  4.307715 -3.633846 -1.446516
H  4.363269 -0.046223 0.020441
H  4.165512 -0.027998 1.764125
H  4.490239 1.476805 0.899035
H  1.199249 4.270366 0.26111
H  -1.586206 3.48836 0.695874
H  -0.956563 5.079738 0.328543
H  -3.242076 -3.612349 -1.211945
H  -1.534945 -3.421134 -0.788056
H  -2.287736 -2.376791 -2.01179
H  -3.573337 -1.858159 1.962339
H  -3.93801 -3.334758 1.08801
H  -2.296749 -3.06329 1.693628
H  -0.659564 4.409476 -2.077495
H  -2.332294 4.224868 -1.550713
H  -1.302808 2.804401 -1.695878
elementType: S O N C H
totalener: -1352.85812217 hartree
nucrepener: 2084.19137983 hartree
electener: -3437.04950200 hartree
oneelecener: -5993.54572114 hartree
twoeener: 2556.49621915 hartree
cpcmener: -0.02591925 hartree
kineticenergy: 1347.71973445 hartree
xcener: -110.804300440908 hartree
chargesum: -0.0000000
charge: 0.914971 -0.286697 -0.486432 -0.484123 -0.392276 -0.392615 -0.166514 -0.220071 -0.135117 -0.100946 -0.204465 -0.148746 0.190638 0.352274 -0.273989 0.384431 -0.298645 0.022494 -0.198094 -0.175006 -0.269421 0.095201 0.092906 0.068672 0.076562 0.079212 0.071727 0.096263 0.072290 0.085578 0.110556 0.113517 0.101764 0.164235 0.075115 0.096881 0.125209 0.108826 0.128979 0.124286 0.112704 0.113710 0.082257 0.087184 0.084714
qa: 0.9150 -0.2867 -0.4864 -0.4841 -0.3923 -0.3926 -0.1665 -0.2201 -0.1351 -0.1009 -0.2045 -0.1487 0.1906 0.3523 -0.2740 0.3844 -0.2986 0.0225 -0.1981 -0.1750 -0.2694 0.0952 0.0929 0.0687 0.0766 0.0792 0.0717 0.0963 0.0723 0.0856 0.1106 0.1135 0.1018 0.1642 0.0751 0.0969 0.1252 0.1088 0.1290 0.1243 0.1127 0.1137 0.0823 0.0872 0.0847
va: 6.0203 2.1088 2.0019 2.0042 3.0460 2.9459 3.0800 3.1610 3.8333 3.8351 3.6633 3.9036 3.8442 4.0399 3.9196 4.2005 3.9235 3.8496 3.9010 3.8958 3.9058 1.0162 1.0015 1.0201 1.0090 1.0070 1.0002 1.0034 1.0003 1.0020 0.9904 0.9931 1.0284 1.0247 1.0176 0.9969 0.9952 0.9877 1.0078 1.0099 0.9928 0.9931 1.0083 1.0082 1.0123
dispcorr: -0.023593497 hartree
energy: -1352.881715663692
dipole: 16.24391 -15.61043 0.63348 -12.52216 10.59138 -1.93078 -7.29762 7.43820 0.14058
magnitude: 2.03691 au
magnitude: 5.17740 debye
