program: Orca
programVersion: 4.2.1
elementType: S O O O N N N N C C C C C C C C C C C C C H H H H H H H H H H H H H H H H H H H H H H H H
charge: 0
multiplicity: 1
keywords: wb97x-d3
keywords: def2-TZVPP
keywords: def2/J RIJCOSX GRIDX6 NOFINALGRIDX
keywords: grid4 nofinalgrid
keywords: scfconv7
keywords: smallprint printgap noloewdin
keywords: NOSOSCF
formula: C13H24N4O3S
InChI: InChI=1/C13H24N4O3S/c1-6-8-9-11-10(3)15-13(14-7-2)16-12(11)20-21(18,19)17(4)5/h14H,6-9H2,1-5H3
45 atoms
S  -1.485822 -1.413535 0.821765
O  -0.41123 -0.942382 -0.329109
O  -1.176753 -0.675813 2.021166
O  -1.400127 -2.851232 0.785134
N  1.887439 2.335611 0.233478
N  -0.139275 1.310137 -0.419829
N  -2.951164 -0.972665 0.278476
N  0.188412 3.578428 -0.650548
C  2.273237 -1.38848 0.668371
C  3.154358 -1.921206 -0.469949
C  1.67426 -0.043257 0.374584
C  2.415491 -2.290312 -1.752344
C  2.389655 1.155769 0.551435
C  0.39255 0.153509 -0.106956
C  1.544863 -3.532039 -1.631647
C  0.647208 2.37468 -0.267744
C  3.760739 1.155279 1.147928
C  -1.164986 3.850014 -1.07353
C  -3.32695 0.43347 0.38187
C  -3.443114 -1.641007 -0.92209
C  -2.119295 4.118176 0.079189
H  1.497515 -2.117553 0.905571
H  2.881253 -1.318327 1.573155
H  3.694887 -2.799604 -0.104015
H  3.919352 -1.176152 -0.704305
H  1.815229 -1.443521 -2.098362
H  3.158717 -2.459676 -2.536466
H  0.751935 -3.418864 -0.892869
H  1.064152 -3.767612 -2.582722
H  2.14033 -4.401517 -1.344348
H  4.156392 2.167537 1.187614
H  4.455272 0.53842 0.576649
H  3.7428 0.755942 2.163959
H  0.780633 4.361629 -0.426678
H  -1.130626 4.716285 -1.735011
H  -1.520821 3.013406 -1.67385
H  -2.895825 1.037132 -0.418306
H  -3.033359 0.843865 1.343156
H  -4.412241 0.484226 0.318265
H  -4.523774 -1.515766 -0.949811
H  -3.020547 -1.216138 -1.835523
H  -3.23723 -2.707029 -0.892543
H  -2.182559 3.262447 0.752014
H  -3.122607 4.324537 -0.296554
H  -1.798339 4.982347 0.663054
elementType: S O N C H
totalener: -1352.85681756 hartree
nucrepener: 2107.07227848 hartree
electener: -3459.92909603 hartree
oneelecener: -6039.09014484 hartree
twoeener: 2579.16104881 hartree
cpcmener: -0.02459375 hartree
kineticenergy: 1347.70611667 hartree
xcener: -110.799069766213 hartree
chargesum: -0.0000000
charge: 0.911597 -0.319662 -0.485671 -0.493622 -0.386414 -0.358981 -0.164326 -0.212479 -0.135855 -0.135552 -0.131735 -0.112938 0.158935 0.282945 -0.266484 0.408568 -0.281739 0.003973 -0.205747 -0.176132 -0.273633 0.081178 0.103194 0.076303 0.084347 0.061120 0.076367 0.068448 0.090612 0.080309 0.098207 0.110591 0.109227 0.163114 0.102768 0.081645 0.116240 0.129317 0.125037 0.112904 0.115636 0.125248 0.078518 0.092705 0.091917
qa: 0.9116 -0.3197 -0.4857 -0.4936 -0.3864 -0.3590 -0.1643 -0.2125 -0.1359 -0.1356 -0.1317 -0.1129 0.1589 0.2829 -0.2665 0.4086 -0.2817 0.0040 -0.2057 -0.1761 -0.2736 0.0812 0.1032 0.0763 0.0843 0.0611 0.0764 0.0684 0.0906 0.0803 0.0982 0.1106 0.1092 0.1631 0.1028 0.0816 0.1162 0.1293 0.1250 0.1129 0.1156 0.1252 0.0785 0.0927 0.0919
va: 6.0268 2.0052 1.9968 2.0038 3.0502 2.9959 3.0684 3.1573 3.8492 3.8796 3.6865 3.8664 3.9112 4.1067 3.9252 4.1431 3.9353 3.8517 3.9034 3.8926 3.9204 1.0304 1.0072 1.0109 1.0110 1.0125 1.0059 1.0117 1.0044 1.0041 1.0238 0.9968 0.9968 1.0256 0.9976 1.0138 0.9941 1.0025 0.9968 0.9931 0.9937 1.0085 1.0033 1.0066 1.0074
dispcorr: -0.024912437 hartree
energy: -1352.881729992726
dipole: 3.54602 -4.22090 -0.67488 1.87820 -0.17917 1.69903 -9.35309 8.09154 -1.26154
magnitude: 2.22119 au
magnitude: 5.64581 debye
