program: Orca
programVersion: 4.2.1
elementType: S O O O N N N N C C C C C C C C C C C C C H H H H H H H H H H H H H H H H H H H H H H H H
charge: 0
multiplicity: 1
keywords: wb97x-d3
keywords: def2-TZVPP
keywords: def2/J RIJCOSX GRIDX6 NOFINALGRIDX
keywords: grid4 nofinalgrid
keywords: scfconv7
keywords: smallprint printgap noloewdin
keywords: NOSOSCF
formula: C13H24N4O3S
InChI: InChI=1/C13H24N4O3S/c1-6-8-9-11-10(3)15-13(14-7-2)16-12(11)20-21(18,19)17(4)5/h14H,6-9H2,1-5H3
45 atoms
S  -1.840671 -1.078342 0.769045
O  -0.391502 -0.941331 0.000232
O  -1.968125 0.009035 1.703715
O  -1.807428 -2.444863 1.222935
N  1.914818 2.369876 -0.019237
N  -0.193806 1.325534 -0.263992
N  -2.971529 -0.952958 -0.389355
N  0.055691 3.593582 -0.542141
C  2.315702 -1.328715 0.639297
C  2.677372 -2.119294 -0.619536
C  1.722664 0.014387 0.33314
C  3.24774 -3.49603 -0.307724
C  2.466988 1.199964 0.26407
C  0.379782 0.188743 0.034451
C  3.581925 -4.289985 -1.561044
C  0.600768 2.396966 -0.261103
C  3.938441 1.200619 0.531125
C  -1.36538 3.835972 -0.640921
C  -3.030506 -2.029425 -1.37412
C  -3.275815 0.370086 -0.923122
C  -2.081827 3.849771 0.700455
H  1.618433 -1.914131 1.243826
H  3.2084 -1.20558 1.256482
H  3.39945 -1.548574 -1.213048
H  1.78807 -2.229233 -1.247589
H  4.145161 -3.388274 0.309395
H  2.528158 -4.055892 0.297813
H  3.981287 -5.275516 -1.31676
H  2.696835 -4.440676 -2.182658
H  4.327515 -3.776888 -2.171975
H  4.150634 0.92079 1.56492
H  4.355232 2.190017 0.356285
H  4.463326 0.487818 -0.106628
H  0.666244 4.38674 -0.434714
H  -1.487267 4.798513 -1.137357
H  -1.811834 3.089196 -1.298146
H  -4.006105 -1.983207 -1.853898
H  -2.94454 -3.002354 -0.899266
H  -2.261108 -1.933501 -2.143996
H  -4.25855 0.312097 -1.387529
H  -3.324864 1.109195 -0.129834
H  -2.550102 0.692698 -1.671125
H  -1.671844 4.61876 1.357213
H  -1.997285 2.888278 1.207478
H  -3.142885 4.062893 0.561082
elementType: S O N C H
totalener: -1352.85922118 hartree
nucrepener: 2064.94337483 hartree
electener: -3417.80259601 hartree
oneelecener: -5954.63316691 hartree
twoeener: 2536.83057090 hartree
cpcmener: -0.02468377 hartree
kineticenergy: 1347.71506407 hartree
xcener: -110.799544901603 hartree
chargesum: -0.0000000
charge: 0.905701 -0.315091 -0.473053 -0.494178 -0.388494 -0.370633 -0.166008 -0.219809 -0.109797 -0.112056 -0.159467 -0.092107 0.168146 0.325845 -0.278526 0.385669 -0.287010 0.003054 -0.178179 -0.200137 -0.279943 0.082613 0.093633 0.065557 0.073811 0.059191 0.059327 0.091067 0.078639 0.078598 0.110345 0.097765 0.108937 0.164015 0.102275 0.082014 0.111271 0.125700 0.116877 0.126073 0.129613 0.111178 0.092442 0.082178 0.092956
qa: 0.9057 -0.3151 -0.4731 -0.4942 -0.3885 -0.3706 -0.1660 -0.2198 -0.1098 -0.1121 -0.1595 -0.0921 0.1681 0.3258 -0.2785 0.3857 -0.2870 0.0031 -0.1782 -0.2001 -0.2799 0.0826 0.0936 0.0656 0.0738 0.0592 0.0593 0.0911 0.0786 0.0786 0.1103 0.0978 0.1089 0.1640 0.1023 0.0820 0.1113 0.1257 0.1169 0.1261 0.1296 0.1112 0.0924 0.0822 0.0930
va: 6.0472 2.0496 2.0062 2.0100 3.0484 2.9752 3.0527 3.1441 3.8036 3.8172 3.7220 3.8675 3.9118 4.0341 3.9454 4.1966 3.9381 3.8655 3.8945 3.9049 3.8969 1.0280 1.0043 1.0129 1.0166 1.0078 1.0077 1.0042 1.0008 1.0005 0.9959 1.0238 0.9937 1.0252 0.9993 1.0054 0.9936 1.0085 0.9927 0.9978 0.9998 1.0003 1.0098 1.0075 1.0056
dispcorr: -0.023008944 hartree
energy: -1352.882230123818
dipole: 10.85202 -10.95481 -0.10278 -4.31924 5.28939 0.97015 -10.70556 8.75957 -1.94599
magnitude: 2.17684 au
magnitude: 5.53309 debye
