program: Orca
programVersion: 4.2.1
elementType: S O O O N N N N C C C C C C C C C C C C C H H H H H H H H H H H H H H H H H H H H H H H H
charge: 0
multiplicity: 1
keywords: wb97x-d3
keywords: def2-TZVPP
keywords: def2/J RIJCOSX GRIDX6 NOFINALGRIDX
keywords: grid4 nofinalgrid
keywords: scfconv7
keywords: smallprint printgap noloewdin
keywords: NOSOSCF
formula: C13H24N4O3S
InChI: InChI=1/C13H24N4O3S/c1-6-8-9-11-10(3)15-13(14-7-2)16-12(11)20-21(18,19)17(4)5/h14H,6-9H2,1-5H3
45 atoms
S  -2.187516 -0.415453 -0.049625
O  -0.565261 -0.692973 -0.186609
O  -2.573746 0.454539 -1.129829
O  -2.467528 -0.08397 1.322537
N  2.072359 2.349406 0.057278
N  -0.119277 1.493835 0.281347
N  -2.732457 -1.912673 -0.352458
N  0.350225 3.681363 0.769994
C  2.110354 -1.320417 -0.850931
C  2.471736 -2.198942 0.348849
C  1.645829 0.048543 -0.451313
C  2.980106 -3.574265 -0.061026
C  2.496048 1.154548 -0.333275
C  0.329836 0.331076 -0.109368
C  3.341228 -4.447792 1.130362
C  0.776884 2.478748 0.354024
C  3.950802 1.039266 -0.661946
C  -1.03259 4.001661 1.044303
C  -2.638402 -2.409057 -1.720119
C  -2.546849 -2.929476 0.675867
C  -1.874769 4.225529 -0.201206
H  2.978253 -1.23663 -1.509197
H  1.341456 -1.820875 -1.444588
H  1.594929 -2.309196 0.994857
H  3.232035 -1.693751 0.953881
H  2.219513 -4.076651 -0.667055
H  3.855453 -3.458564 -0.707776
H  2.479077 -4.61241 1.779948
H  3.704133 -5.426952 0.814021
H  4.124797 -3.988668 1.736561
H  4.430177 0.23988 -0.095049
H  4.464313 1.972323 -0.440842
H  4.09877 0.813558 -1.719928
H  1.022509 4.429312 0.733357
H  -1.470995 3.206399 1.648203
H  -1.031086 4.900543 1.660521
H  -2.868807 -1.628618 -2.439281
H  -3.381053 -3.195637 -1.841014
H  -1.653367 -2.824775 -1.944926
H  -3.283651 -3.712487 0.505533
H  -1.550977 -3.378051 0.642671
H  -2.723413 -2.523906 1.667555
H  -2.894315 4.495917 0.078578
H  -1.92808 3.322439 -0.809057
H  -1.471271 5.033166 -0.813692
elementType: S O N C H
totalener: -1352.86168999 hartree
nucrepener: 2054.53923419 hartree
electener: -3407.40092418 hartree
oneelecener: -5934.18030946 hartree
twoeener: 2526.77938528 hartree
cpcmener: -0.02628409 hartree
kineticenergy: 1347.72471968 hartree
xcener: -110.802173437035 hartree
chargesum: 0.0000000
charge: 0.915878 -0.279979 -0.485015 -0.485982 -0.394742 -0.395970 -0.175867 -0.219851 -0.116303 -0.118890 -0.187201 -0.090689 0.174416 0.345533 -0.276562 0.386829 -0.284087 0.023867 -0.177718 -0.176535 -0.269165 0.092694 0.085941 0.071787 0.069048 0.057886 0.060402 0.077943 0.091131 0.079212 0.106738 0.097844 0.109409 0.164275 0.074542 0.096307 0.125332 0.113981 0.110501 0.113450 0.111153 0.124562 0.087250 0.084700 0.081947
qa: 0.9159 -0.2800 -0.4850 -0.4860 -0.3947 -0.3960 -0.1759 -0.2199 -0.1163 -0.1189 -0.1872 -0.0907 0.1744 0.3455 -0.2766 0.3868 -0.2841 0.0239 -0.1777 -0.1765 -0.2692 0.0927 0.0859 0.0718 0.0690 0.0579 0.0604 0.0779 0.0911 0.0792 0.1067 0.0978 0.1094 0.1643 0.0745 0.0963 0.1253 0.1140 0.1105 0.1135 0.1112 0.1246 0.0872 0.0847 0.0819
va: 6.0214 2.1172 2.0046 2.0031 3.0475 2.9506 3.0832 3.1613 3.8205 3.8156 3.6934 3.8643 3.9043 4.0420 3.9453 4.1965 3.9377 3.8499 3.9000 3.9009 3.9039 1.0045 1.0174 1.0154 1.0139 1.0075 1.0083 1.0010 1.0040 1.0005 0.9941 1.0243 0.9960 1.0248 1.0182 0.9972 1.0093 0.9940 0.9919 0.9937 0.9915 1.0096 1.0078 1.0127 1.0083
dispcorr: -0.021771606 hartree
energy: -1352.883461593342
dipole: 14.76150 -13.94343 0.81807 -16.30307 14.49945 -1.80362 -0.98136 0.38696 -0.59440
magnitude: 2.06776 au
magnitude: 5.25582 debye
