program: Orca
programVersion: 4.2.1
elementType: S O O O N N N N C C C C C C C C C C C C C H H H H H H H H H H H H H H H H H H H H H H H H
charge: 0
multiplicity: 1
keywords: wb97x-d3
keywords: def2-TZVPP
keywords: def2/J RIJCOSX GRIDX6 NOFINALGRIDX
keywords: grid4 nofinalgrid
keywords: scfconv7
keywords: smallprint printgap noloewdin
keywords: NOSOSCF
formula: C13H24N4O3S
InChI: InChI=1/C13H24N4O3S/c1-6-8-9-11-10(3)15-13(14-7-2)16-12(11)20-21(18,19)17(4)5/h14H,6-9H2,1-5H3
45 atoms
S  -1.523411 -1.357996 0.633387
O  -0.471313 -0.798272 -0.492354
O  -1.164799 -0.754154 1.893106
O  -1.467726 -2.784176 0.445041
N  1.839513 2.46828 0.058873
N  -0.235518 1.464367 -0.47105
N  -2.995832 -0.8340 0.184616
N  0.053299 3.745186 -0.572922
C  2.184552 -1.276485 0.424314
C  2.613412 -1.984228 -0.862716
C  1.61979 0.091667 0.178731
C  3.203362 -3.371197 -0.629479
C  2.362666 1.277633 0.299067
C  0.316867 0.301383 -0.235344
C  2.233769 -4.353389 0.014174
C  0.556169 2.526509 -0.315546
C  3.798695 1.248172 0.714114
C  -1.325902 4.017502 -0.90196
C  -3.518727 -1.343016 -1.079495
C  -3.341043 0.558878 0.450394
C  -2.222497 4.186356 0.313952
H  1.454478 -1.888198 0.957631
H  3.041402 -1.204246 1.097871
H  3.347654 -1.36303 -1.384258
H  1.753749 -2.067789 -1.533867
H  3.532719 -3.771608 -1.592035
H  4.104465 -3.288358 -0.013524
H  1.288656 -4.395095 -0.53193
H  2.649507 -5.362004 0.0303
H  2.000758 -4.088099 1.046265
H  3.907911 0.873719 1.73372
H  4.225552 2.247763 0.673339
H  4.388612 0.595035 0.069241
H  0.66122 4.523507 -0.377243
H  -1.342223 4.928088 -1.501686
H  -1.700422 3.217818 -1.540368
H  -3.117491 -0.80161 -1.939429
H  -4.59975 -1.217463 -1.065474
H  -3.313278 -2.403166 -1.194375
H  -4.427127 0.631567 0.445094
H  -2.995072 0.865631 1.432619
H  -2.935862 1.233227 -0.305174
H  -3.25179 4.372797 0.003436
H  -1.902002 5.029539 0.927582
H  -2.218783 3.294633 0.941044
elementType: S O N C H
totalener: -1352.85815338 hartree
nucrepener: 2083.92255054 hartree
electener: -3436.78070392 hartree
oneelecener: -5992.77722825 hartree
twoeener: 2555.99652434 hartree
cpcmener: -0.02474081 hartree
kineticenergy: 1347.71427926 hartree
xcener: -110.799762033195 hartree
chargesum: 0.0000000
charge: 0.904892 -0.321561 -0.487177 -0.488722 -0.386966 -0.364105 -0.165144 -0.210582 -0.143585 -0.102502 -0.147889 -0.112704 0.170818 0.296231 -0.278776 0.410227 -0.286617 -0.000320 -0.175931 -0.207161 -0.274734 0.082579 0.099544 0.077891 0.077811 0.070101 0.058500 0.080706 0.093897 0.078329 0.111743 0.097438 0.108052 0.164102 0.103709 0.082288 0.113945 0.112464 0.125247 0.124784 0.130122 0.114520 0.093341 0.092976 0.078218
qa: 0.9049 -0.3216 -0.4872 -0.4887 -0.3870 -0.3641 -0.1651 -0.2106 -0.1436 -0.1025 -0.1479 -0.1127 0.1708 0.2962 -0.2788 0.4102 -0.2866 -0.0003 -0.1759 -0.2072 -0.2747 0.0826 0.0995 0.0779 0.0778 0.0701 0.0585 0.0807 0.0939 0.0783 0.1117 0.0974 0.1081 0.1641 0.1037 0.0823 0.1139 0.1125 0.1252 0.1248 0.1301 0.1145 0.0933 0.0930 0.0782
va: 6.0406 2.0184 1.9895 2.0152 3.0508 3.0021 3.0701 3.1535 3.8117 3.8177 3.7070 3.8792 3.9067 4.1192 3.9297 4.1429 3.9450 3.8489 3.8927 3.9079 3.9182 1.0289 1.0041 1.0161 1.0186 1.0071 1.0085 1.0040 1.0046 0.9987 0.9953 1.0239 0.9940 1.0254 0.9975 1.0128 0.9947 0.9932 1.0093 0.9968 1.0025 0.9929 1.0061 1.0076 1.0033
dispcorr: -0.023946126 hartree
energy: -1352.882099504119
dipole: 5.03145 -5.70551 -0.67407 -0.41301 2.26029 1.84728 -4.49041 3.37193 -1.11848
magnitude: 2.26225 au
magnitude: 5.75019 debye
