program: Orca
programVersion: 4.2.1
elementType: S O O O N N N N C C C C C C C C C C C C C H H H H H H H H H H H H H H H H H H H H H H H H
charge: 0
multiplicity: 1
keywords: wb97x-d3
keywords: def2-TZVPP
keywords: def2/J RIJCOSX GRIDX6 NOFINALGRIDX
keywords: grid4 nofinalgrid
keywords: scfconv7
keywords: smallprint printgap noloewdin
keywords: NOSOSCF
formula: C13H24N4O3S
InChI: InChI=1/C13H24N4O3S/c1-6-8-9-11-10(3)15-13(14-7-2)16-12(11)20-21(18,19)17(4)5/h14H,6-9H2,1-5H3
45 atoms
S  -1.867203 -1.148348 0.803683
O  -0.239828 -1.028151 0.564368
O  -2.302875 -0.134425 1.727183
O  -1.947668 -2.541997 1.160747
N  1.765393 2.34924 -0.341703
N  -0.261231 1.221895 0.117326
N  -2.573374 -0.935001 -0.634917
N  -0.210671 3.487927 -0.299788
C  2.52875 -1.302177 0.274025
C  2.536152 -2.112482 -1.024991
C  1.805344 0.005195 0.134909
C  3.295412 -3.431328 -0.922948
C  2.430888 1.210527 -0.199569
C  0.425973 0.120695 0.266282
C  2.679385 -4.426147 0.050686
C  0.441816 2.32091 -0.167337
C  3.910975 1.27505 -0.406314
C  -1.598311 3.730733 0.020012
C  -2.173499 -1.819062 -1.722097
C  -3.090525 0.36217 -1.04579
C  -1.755579 4.760876 1.124849
H  2.077318 -1.888709 1.07624
H  3.559638 -1.120273 0.587976
H  2.978802 -1.505229 -1.820264
H  1.505273 -2.312043 -1.334149
H  3.337692 -3.884876 -1.916931
H  4.333765 -3.232885 -0.638381
H  2.724977 -4.077891 1.083565
H  1.629436 -4.612896 -0.185855
H  3.198181 -5.385367 0.013933
H  4.244841 0.557174 -1.156924
H  4.448007 1.045067 0.51599
H  4.205776 2.270981 -0.729322
H  0.370464 4.28683 -0.498796
H  -2.13022 4.062124 -0.876108
H  -2.046399 2.788156 0.324039
H  -3.019958 -1.927996 -2.397882
H  -1.916663 -2.809697 -1.357214
H  -1.329661 -1.4143 -2.285126
H  -2.352283 0.947447 -1.592754
H  -3.94681 0.178107 -1.693693
H  -3.440042 0.931388 -0.191425
H  -1.308387 5.717903 0.849846
H  -1.288552 4.421335 2.050131
H  -2.812611 4.938706 1.326542
elementType: S O N C H
totalener: -1352.85758615 hartree
nucrepener: 2071.33226560 hartree
electener: -3424.18985175 hartree
oneelecener: -5967.10511765 hartree
twoeener: 2542.91526590 hartree
cpcmener: -0.02645000 hartree
kineticenergy: 1347.71450551 hartree
xcener: -110.806118917163 hartree
chargesum: 0.0000000
charge: 0.875416 -0.274813 -0.473550 -0.495732 -0.396323 -0.402438 -0.156334 -0.198151 -0.109323 -0.115123 -0.189527 -0.112025 0.169558 0.343672 -0.275239 0.388347 -0.284864 0.001902 -0.177808 -0.191830 -0.254947 0.088347 0.094226 0.078376 0.071369 0.070596 0.057896 0.079282 0.079081 0.092637 0.106625 0.109149 0.097644 0.154876 0.089022 0.084473 0.121540 0.123443 0.108790 0.112963 0.130459 0.121634 0.087038 0.083777 0.085892
qa: 0.8754 -0.2748 -0.4736 -0.4957 -0.3963 -0.4024 -0.1563 -0.1982 -0.1093 -0.1151 -0.1895 -0.1120 0.1696 0.3437 -0.2752 0.3883 -0.2849 0.0019 -0.1778 -0.1918 -0.2549 0.0883 0.0942 0.0784 0.0714 0.0706 0.0579 0.0793 0.0791 0.0926 0.1066 0.1091 0.0976 0.1549 0.0890 0.0845 0.1215 0.1234 0.1088 0.1130 0.1305 0.1216 0.0870 0.0838 0.0859
va: 6.0925 2.0972 2.0062 2.0033 3.0418 2.9547 3.0447 3.1482 3.7900 3.8475 3.7033 3.8799 3.9168 4.0186 3.9315 4.1971 3.9385 3.8706 3.8904 3.9011 3.9520 1.0183 1.0019 1.0151 1.0130 1.0070 1.0086 0.9987 1.0014 1.0041 0.9947 0.9962 1.0243 1.0296 0.9940 1.0101 0.9950 1.0090 0.9922 0.9896 0.9961 1.0059 1.0015 1.0042 1.0087
dispcorr: -0.023153525 hartree
energy: -1352.880739680253
dipole: 12.13659 -11.75051 0.38608 -1.60422 2.79389 1.18967 -10.89384 8.51916 -2.37468
magnitude: 2.68393 au
magnitude: 6.82201 debye
