program: Orca
programVersion: 4.2.1
elementType: S O O O N N N N C C C C C C C C C C C C C H H H H H H H H H H H H H H H H H H H H H H H H
charge: 0
multiplicity: 1
keywords: wb97x-d3
keywords: def2-TZVPP
keywords: def2/J RIJCOSX GRIDX6 NOFINALGRIDX
keywords: grid4 nofinalgrid
keywords: scfconv7
keywords: smallprint printgap noloewdin
keywords: NOSOSCF
formula: C13H24N4O3S
InChI: InChI=1/C13H24N4O3S/c1-6-8-9-11-10(3)15-13(14-7-2)16-12(11)20-21(18,19)17(4)5/h14H,6-9H2,1-5H3
45 atoms
S  -1.478481 -1.386212 0.423253
O  -0.485755 -0.717288 -0.703227
O  -1.110673 -0.837623 1.70428
O  -1.363295 -2.795776 0.151842
N  1.862121 2.467835 0.113217
N  -0.273614 1.49522 -0.187921
N  -2.982406 -0.913599 0.038702
N  -0.033513 3.72579 0.320178
C  2.309069 -1.217653 -0.578147
C  2.459868 -2.006808 0.725042
C  1.691828 0.133854 -0.370981
C  3.045247 -3.401791 0.530063
C  2.434038 1.295548 -0.104439
C  0.324402 0.347675 -0.388172
C  2.18425 -4.312954 -0.334742
C  0.526161 2.53012 0.071755
C  3.927803 1.257989 -0.057801
C  -1.444901 4.009914 0.210563
C  -3.545079 -1.427673 -1.20554
C  -3.393638 0.44449 0.373726
C  -1.915598 4.242849 -1.216372
H  3.289719 -1.108941 -1.048012
H  1.70576 -1.787427 -1.286196
H  1.485476 -2.093326 1.214841
H  3.09236 -1.442812 1.417224
H  4.048048 -3.32344 0.097932
H  3.17641 -3.860972 1.513452
H  2.161373 -3.99213 -1.37719
H  2.560503 -5.336974 -0.325332
H  1.152177 -4.33666 0.021618
H  4.344235 0.991272 -1.031212
H  4.288937 0.516811 0.656538
H  4.324136 2.230222 0.226362
H  0.604984 4.49725 0.422385
H  -2.007587 3.193501 0.663522
H  -1.640702 4.895159 0.815668
H  -3.197296 -0.871733 -2.079342
H  -4.62731 -1.331646 -1.142937
H  -3.316695 -2.481374 -1.335964
H  -3.030808 0.731338 1.355732
H  -3.054987 1.173896 -0.363852
H  -4.481625 0.453693 0.406351
H  -2.984379 4.461865 -1.232325
H  -1.745038 3.365193 -1.840561
H  -1.395895 5.088263 -1.670015
elementType: S O N C H
totalener: -1352.85818693 hartree
nucrepener: 2087.62317719 hartree
electener: -3440.48136413 hartree
oneelecener: -6000.35151984 hartree
twoeener: 2559.87015571 hartree
cpcmener: -0.02454821 hartree
kineticenergy: 1347.71426001 hartree
xcener: -110.800885471173 hartree
chargesum: 0.0000000
charge: 0.910784 -0.320772 -0.484839 -0.490400 -0.385258 -0.362931 -0.164116 -0.212823 -0.133788 -0.120436 -0.140838 -0.108154 0.160029 0.296111 -0.282731 0.405748 -0.283497 -0.009079 -0.177477 -0.195835 -0.267483 0.095861 0.097220 0.067405 0.080467 0.058438 0.071318 0.077645 0.094332 0.080754 0.109969 0.108050 0.097827 0.164053 0.083668 0.101871 0.116402 0.111706 0.126034 0.127059 0.109169 0.125510 0.090188 0.083215 0.089627
qa: 0.9108 -0.3208 -0.4848 -0.4904 -0.3853 -0.3629 -0.1641 -0.2128 -0.1338 -0.1204 -0.1408 -0.1082 0.1600 0.2961 -0.2827 0.4057 -0.2835 -0.0091 -0.1775 -0.1958 -0.2675 0.0959 0.0972 0.0674 0.0805 0.0584 0.0713 0.0776 0.0943 0.0808 0.1100 0.1081 0.0978 0.1641 0.0837 0.1019 0.1164 0.1117 0.1260 0.1271 0.1092 0.1255 0.0902 0.0832 0.0896
va: 6.0252 2.0255 1.9879 2.0116 3.0508 2.9889 3.0856 3.1482 3.8114 3.8398 3.6914 3.8717 3.9241 4.0940 3.9284 4.1541 3.9391 3.8817 3.8925 3.9062 3.8939 1.0039 1.0150 1.0346 1.0167 1.0087 1.0073 0.9983 1.0048 1.0076 0.9962 0.9954 1.0238 1.0256 1.0037 0.9996 0.9928 0.9935 1.0089 1.0060 0.9921 0.9972 1.0071 1.0097 1.0075
dispcorr: -0.024061017 hartree
energy: -1352.882247951375
dipole: 4.92109 -5.73322 -0.81212 -0.56457 2.34775 1.78319 -5.68145 4.56056 -1.12089
magnitude: 2.25736 au
magnitude: 5.73776 debye
