program: Orca
programVersion: 4.2.1
elementType: S O O O N N N N C C C C C C C C C C C C C H H H H H H H H H H H H H H H H H H H H H H H H
charge: 0
multiplicity: 1
keywords: wb97x-d3
keywords: def2-TZVPP
keywords: def2/J RIJCOSX GRIDX6 NOFINALGRIDX
keywords: grid4 nofinalgrid
keywords: scfconv7
keywords: smallprint printgap noloewdin
keywords: NOSOSCF
formula: C13H24N4O3S
InChI: InChI=1/C13H24N4O3S/c1-6-8-9-11-10(3)15-13(14-7-2)16-12(11)20-21(18,19)17(4)5/h14H,6-9H2,1-5H3
45 atoms
S  -1.659852 -1.486639 -0.179832
O  -0.535665 -0.662751 -1.059573
O  -1.058941 -1.840324 1.079837
O  -2.090281 -2.462335 -1.137854
N  1.694974 2.37085 0.39974
N  -0.393191 1.444935 -0.211854
N  -2.879259 -0.448688 0.113182
N  -0.214264 3.607388 0.568418
C  2.266709 -1.178684 -0.738957
C  2.451295 -2.107868 0.463265
C  1.593736 0.116981 -0.392794
C  3.178807 -3.394918 0.09932
C  2.293383 1.234181 0.08918
C  0.228706 0.325426 -0.509428
C  3.379685 -4.31294 1.29607
C  0.373137 2.434691 0.238604
C  3.780883 1.200256 0.257598
C  -1.56633 3.964517 0.214362
C  -2.976694 0.242362 1.3858
C  -3.488032 0.216817 -1.023698
C  -1.765044 4.261269 -1.265815
H  3.243276 -0.971132 -1.185781
H  1.695899 -1.700867 -1.50875
H  1.474435 -2.343191 0.89004
H  3.005103 -1.587839 1.252153
H  2.61405 -3.922073 -0.675311
H  4.149714 -3.154781 -0.345823
H  2.424654 -4.591195 1.743731
H  3.892428 -5.232796 1.014272
H  3.975728 -3.828212 2.071231
H  4.098708 0.355102 0.867968
H  4.123315 2.119331 0.72534
H  4.279372 1.100183 -0.708603
H  0.433066 4.343679 0.791072
H  -2.237995 3.163845 0.523996
H  -1.834643 4.8364 0.812374
H  -2.456325 1.200085 1.375439
H  -2.577023 -0.368478 2.188229
H  -4.03426 0.412689 1.588506
H  -3.465464 -0.421806 -1.90298
H  -4.533234 0.415612 -0.788264
H  -2.984118 1.159421 -1.250685
H  -1.530441 3.387746 -1.873192
H  -1.129313 5.083837 -1.594639
H  -2.800529 4.540723 -1.464001
totalener: -1352.83596649 hartree
nucrepener: 2081.78229202 hartree
electener: -3434.61825851 hartree
oneelecener: -5987.35853848 hartree
twoeener: 2552.74027997 hartree
kineticenergy: 1347.74344623 hartree
xcener: -110.803829503896 hartree
chargesum: -0.0000000
charge: 0.879463 -0.304038 -0.456926 -0.429209 -0.337039 -0.395596 -0.147328 -0.216489 -0.142755 -0.132727 -0.092858 -0.086046 0.144785 0.308568 -0.257813 0.404393 -0.289280 -0.016081 -0.205089 -0.180436 -0.248213 0.081161 0.100872 0.097223 0.054858 0.060653 0.049729 0.081069 0.084151 0.069128 0.102145 0.106898 0.096650 0.139560 0.074283 0.089629 0.099919 0.136258 0.103112 0.127306 0.098843 0.092566 0.088085 0.083882 0.082736
qa: 0.8795 -0.3040 -0.4569 -0.4292 -0.3370 -0.3956 -0.1473 -0.2165 -0.1428 -0.1327 -0.0929 -0.0860 0.1448 0.3086 -0.2578 0.4044 -0.2893 -0.0161 -0.2051 -0.1804 -0.2482 0.0812 0.1009 0.0972 0.0549 0.0607 0.0497 0.0811 0.0842 0.0691 0.1021 0.1069 0.0966 0.1396 0.0743 0.0896 0.0999 0.1363 0.1031 0.1273 0.0988 0.0926 0.0881 0.0839 0.0827
va: 6.0572 2.0552 2.0295 2.0848 3.0774 2.9935 3.0551 3.1294 3.8425 3.8398 3.6855 3.8692 3.9238 4.0668 3.9550 4.1382 3.9185 3.9191 3.9146 3.9105 3.8857 1.0055 1.0190 1.0281 1.0143 1.0100 1.0085 1.0032 1.0056 1.0026 0.9968 1.0243 0.9989 1.0434 0.9967 1.0022 0.9811 1.0125 0.9917 1.0140 0.9955 0.9895 1.0108 1.0113 1.0096
dispcorr: -0.023990691 hartree
energy: -1352.859957176877
dipole: 9.93326 -10.08500 -0.15174 2.99636 -1.12588 1.87048 2.91958 -2.80024 0.11934
magnitude: 1.88041 au
magnitude: 4.77963 debye
