program: Orca
programVersion: 4.2.1
elementType: S O O O N N N N C C C C C C C C C C C C C H H H H H H H H H H H H H H H H H H H H H H H H
charge: 0
multiplicity: 1
keywords: wb97x-d3
keywords: def2-TZVPP
keywords: def2/J RIJCOSX GRIDX6 NOFINALGRIDX
keywords: grid4 nofinalgrid
keywords: scfconv7
keywords: smallprint printgap noloewdin
keywords: NOSOSCF
formula: C13H24N4O3S
InChI: InChI=1/C13H24N4O3S/c1-6-8-9-11-10(3)15-13(14-7-2)16-12(11)20-21(18,19)17(4)5/h14H,6-9H2,1-5H3
45 atoms
S  -1.698068 -1.441282 0.715691
O  -0.494963 -0.890135 -0.26757
O  -1.497258 -0.853931 2.012531
O  -1.672844 -2.858324 0.489425
N  1.80099 2.28995 0.705172
N  -0.211943 1.360153 -0.120167
N  -3.076386 -0.846337 0.068297
N  0.109428 3.636786 -0.02131
C  2.065568 -1.466985 0.911471
C  2.956928 -2.015877 -0.20766
C  1.534654 -0.085727 0.655635
C  2.243939 -2.23148 -1.535786
C  2.269868 1.076996 0.93795
C  0.284314 0.168773 0.116552
C  3.164207 -2.8306 -2.589707
C  0.574689 2.387942 0.189323
C  3.634305 1.001431 1.550989
C  -1.138177 3.942436 -0.675151
C  -3.438372 -1.319808 -1.258007
C  -3.418645 0.543635 0.326837
C  -1.122097 3.719489 -2.181292
H  1.243981 -2.16474 1.079197
H  2.634005 -1.462062 1.844558
H  3.378913 -2.967402 0.130592
H  3.811414 -1.349295 -0.36341
H  1.378842 -2.881767 -1.382692
H  1.846811 -1.281049 -1.901606
H  2.645624 -2.97755 -3.537231
H  4.021603 -2.182863 -2.781432
H  3.552104 -3.800568 -2.273864
H  4.308928 0.379014 0.962942
H  3.587338 0.563844 2.550077
H  4.059971 1.997763 1.633283
H  0.769937 4.373108 0.153159
H  -1.932289 3.349103 -0.219378
H  -1.368717 4.985181 -0.453159
H  -4.506812 -1.156403 -1.39252
H  -3.249721 -2.384903 -1.352282
H  -2.901434 -0.78642 -2.047563
H  -3.177205 0.814209 1.349951
H  -2.90322 1.227087 -0.350911
H  -4.495067 0.647244 0.193915
H  -0.351937 4.32364 -2.661313
H  -2.083049 3.99356 -2.618516
H  -0.93133 2.673267 -2.415609
totalener: -1352.83500138 hartree
nucrepener: 2090.99799776 hartree
electener: -3443.83299914 hartree
oneelecener: -6005.96775520 hartree
twoeener: 2562.13475606 hartree
kineticenergy: 1347.74149109 hartree
xcener: -110.799797999793 hartree
chargesum: -0.0000000
charge: 0.882836 -0.315586 -0.435061 -0.440979 -0.341626 -0.373735 -0.160922 -0.214301 -0.128240 -0.136864 -0.105892 -0.068769 0.142195 0.302271 -0.260875 0.420574 -0.290130 -0.031011 -0.188953 -0.214829 -0.238914 0.090995 0.088873 0.069717 0.059990 0.065529 0.054499 0.085069 0.070863 0.074024 0.100373 0.098801 0.106002 0.139808 0.079639 0.089380 0.095059 0.129840 0.107640 0.136024 0.101514 0.107500 0.078581 0.078066 0.091025
qa: 0.8828 -0.3156 -0.4351 -0.4410 -0.3416 -0.3737 -0.1609 -0.2143 -0.1282 -0.1369 -0.1059 -0.0688 0.1422 0.3023 -0.2609 0.4206 -0.2901 -0.0310 -0.1890 -0.2148 -0.2389 0.0910 0.0889 0.0697 0.0600 0.0655 0.0545 0.0851 0.0709 0.0740 0.1004 0.0988 0.1060 0.1398 0.0796 0.0894 0.0951 0.1298 0.1076 0.1360 0.1015 0.1075 0.0786 0.0781 0.0910
va: 6.0547 2.0181 2.0513 2.0643 3.0766 2.9855 3.0589 3.1405 3.8630 3.8824 3.6767 3.8420 3.9268 4.0883 3.9564 4.1165 3.9251 3.9210 3.9115 3.9217 3.8709 1.0375 1.0071 1.0128 1.0087 1.0162 1.0136 1.0052 1.0019 1.0037 0.9974 0.9992 1.0244 1.0439 1.0039 1.0001 0.9941 1.0117 0.9940 1.0077 0.9929 0.9966 1.0124 1.0109 1.0148
dispcorr: -0.023766989 hartree
energy: -1352.858768368561
dipole: 9.28503 -9.56355 -0.27852 3.05299 -1.72886 1.32413 -15.31527 14.41167 -0.90359
magnitude: 1.62708 au
magnitude: 4.13570 debye
