program: Orca
programVersion: 4.2.1
elementType: S O O O N N N N C C C C C C C C C C C C C H H H H H H H H H H H H H H H H H H H H H H H H
charge: 0
multiplicity: 1
keywords: wb97x-d3
keywords: def2-TZVPP
keywords: def2/J RIJCOSX GRIDX6 NOFINALGRIDX
keywords: grid4 nofinalgrid
keywords: scfconv7
keywords: smallprint printgap noloewdin
keywords: NOSOSCF
formula: C13H24N4O3S
InChI: InChI=1/C13H24N4O3S/c1-6-8-9-11-10(3)15-13(14-7-2)16-12(11)20-21(18,19)17(4)5/h14H,6-9H2,1-5H3
45 atoms
S  -1.712298 -1.185756 0.722031
O  -0.371696 -0.955856 -0.219669
O  -1.720105 -0.179822 1.747142
O  -1.641735 -2.588917 1.013579
N  1.883472 2.390218 -0.136275
N  -0.215181 1.322074 -0.367541
N  -2.974207 -0.942498 -0.288081
N  -0.005593 3.608917 -0.5320
C  2.365168 -1.326221 0.325932
C  2.75117 -2.025698 -0.979893
C  1.740016 0.0176 0.096712
C  3.422417 -3.380498 -0.77589
C  2.46129 1.218124 0.067348
C  0.384356 0.178074 -0.148892
C  2.511817 -4.430627 -0.152863
C  0.564652 2.400434 -0.33162
C  3.94194 1.236117 0.293987
C  -1.429773 3.836619 -0.503673
C  -3.131349 -1.884262 -1.385103
C  -3.364989 0.422072 -0.60156
C  -2.036421 3.774995 0.892064
H  1.679516 -1.956523 0.894349
H  3.255932 -1.216905 0.950094
H  3.419438 -1.37234 -1.548888
H  1.856058 -2.152074 -1.595656
H  3.776049 -3.743731 -1.744324
H  4.317584 -3.254939 -0.158461
H  2.204439 -4.163436 0.858216
H  1.603237 -4.561762 -0.742624
H  3.009616 -5.398632 -0.093294
H  4.327247 2.242269 0.152674
H  4.461032 0.561735 -0.388116
H  4.185533 0.914108 1.308155
H  0.611007 4.388596 -0.382197
H  -1.608726 4.815605 -0.950567
H  -1.912462 3.108048 -1.15523
H  -2.487277 -1.641824 -2.235255
H  -4.168808 -1.845733 -1.714535
H  -2.923659 -2.897947 -1.056452
H  -3.303738 1.051923 0.279902
H  -2.749394 0.859832 -1.390111
H  -4.403562 0.396852 -0.929841
H  -1.593699 4.52535 1.548002
H  -1.880677 2.796016 1.344733
H  -3.110358 3.963127 0.851709
totalener: -1352.83504492 hartree
nucrepener: 2079.98174952 hartree
electener: -3432.81679444 hartree
oneelecener: -5983.96789543 hartree
twoeener: 2551.15110099 hartree
kineticenergy: 1347.74363650 hartree
xcener: -110.799914272767 hartree
chargesum: -0.0000000
charge: 0.891292 -0.322192 -0.431898 -0.438502 -0.340745 -0.367849 -0.161502 -0.218964 -0.107872 -0.111547 -0.147882 -0.113698 0.146290 0.325713 -0.250952 0.395256 -0.292903 -0.012056 -0.188625 -0.217854 -0.261729 0.089178 0.083327 0.069757 0.076849 0.066696 0.051928 0.078495 0.078910 0.082966 0.106366 0.097560 0.098880 0.139492 0.089402 0.077442 0.105861 0.095310 0.130084 0.133013 0.107574 0.109066 0.082664 0.096416 0.080983
qa: 0.8913 -0.3222 -0.4319 -0.4385 -0.3407 -0.3678 -0.1615 -0.2190 -0.1079 -0.1115 -0.1479 -0.1137 0.1463 0.3257 -0.2510 0.3953 -0.2929 -0.0121 -0.1886 -0.2179 -0.2617 0.0892 0.0833 0.0698 0.0768 0.0667 0.0519 0.0785 0.0789 0.0830 0.1064 0.0976 0.0989 0.1395 0.0894 0.0774 0.1059 0.0953 0.1301 0.1330 0.1076 0.1091 0.0827 0.0964 0.0810
va: 6.0458 2.0403 2.0502 2.0714 3.0710 2.9898 3.0472 3.1444 3.7897 3.8424 3.7551 3.8903 3.9338 4.0542 3.9364 4.1652 3.9266 3.8937 3.9123 3.9263 3.8961 1.0299 1.0040 1.0170 1.0171 1.0074 1.0091 1.0033 1.0038 1.0043 1.0247 0.9963 0.9981 1.0430 1.0006 1.0074 0.9935 0.9946 1.0120 1.0044 0.9985 0.9986 1.0133 1.0077 1.0076
dispcorr: -0.023679400 hartree
energy: -1352.858724323743
dipole: 8.17102 -8.36170 -0.19067 -3.39828 4.20647 0.80819 -7.31604 6.13521 -1.18083
magnitude: 1.44357 au
magnitude: 3.66926 debye
