program: Orca
programVersion: 4.2.1
elementType: S O O O N N N N C C C C C C C C C C C C C H H H H H H H H H H H H H H H H H H H H H H H H
charge: 0
multiplicity: 1
keywords: wb97x-d3
keywords: def2-TZVPP
keywords: def2/J RIJCOSX GRIDX6 NOFINALGRIDX
keywords: grid4 nofinalgrid
keywords: scfconv7
keywords: smallprint printgap noloewdin
keywords: NOSOSCF
formula: C13H24N4O3S
InChI: InChI=1/C13H24N4O3S/c1-6-8-9-11-10(3)15-13(14-7-2)16-12(11)20-21(18,19)17(4)5/h14H,6-9H2,1-5H3
45 atoms
S  -1.610568 -1.323417 0.18395
O  -0.502419 -0.781309 -0.913171
O  -1.384894 -0.630033 1.422379
O  -1.503948 -2.750239 0.071097
N  1.871835 2.413074 -0.227827
N  -0.274341 1.450751 -0.483848
N  -3.05275 -0.871868 -0.438065
N  -0.008389 3.700366 -0.07696
C  2.274356 -1.303563 -0.747834
C  2.355805 -2.037931 0.592668
C  1.67457 0.065303 -0.622083
C  2.94414 -3.435749 0.461085
C  2.428234 1.226986 -0.405729
C  0.306796 0.287964 -0.646268
C  3.026992 -4.164428 1.794136
C  0.540556 2.479621 -0.262662
C  3.924423 1.177654 -0.35433
C  -1.413388 3.912017 0.172735
C  -3.4419 0.52501 -0.328322
C  -3.469813 -1.519255 -1.672305
C  -1.859223 3.490769 1.567149
H  3.275404 -1.23132 -1.180068
H  1.691946 -1.904677 -1.448822
H  1.357876 -2.105112 1.034113
H  2.954472 -1.450063 1.296596
H  2.333558 -4.01732 -0.235633
H  3.940793 -3.373165 0.012545
H  2.039305 -4.270083 2.244786
H  3.44602 -5.164261 1.679537
H  3.655011 -3.623042 2.503583
H  4.340326 0.876894 -1.317702
H  4.274748 0.455304 0.383876
H  4.320545 2.157039 -0.100104
H  0.644157 4.41393 0.19765
H  -1.613915 4.972795 0.015993
H  -1.986191 3.375041 -0.583542
H  -4.526088 0.571986 -0.423893
H  -2.985241 1.145916 -1.102015
H  -3.169998 0.923873 0.643194
H  -4.548141 -1.397643 -1.76463
H  -2.994124 -1.080121 -2.553841
H  -3.255414 -2.583021 -1.641521
H  -1.655397 2.434194 1.739741
H  -2.930126 3.656033 1.694491
H  -1.34164 4.063662 2.337199
totalener: -1352.83657390 hartree
nucrepener: 2083.96820866 hartree
electener: -3436.80478256 hartree
oneelecener: -5992.00185740 hartree
twoeener: 2555.19707484 hartree
kineticenergy: 1347.74695418 hartree
xcener: -110.799730575443 hartree
chargesum: -0.0000000
charge: 0.889383 -0.319769 -0.436083 -0.440204 -0.339724 -0.362245 -0.159649 -0.218438 -0.115537 -0.114536 -0.137452 -0.089508 0.149345 0.319316 -0.257640 0.397463 -0.288455 -0.007960 -0.217028 -0.188214 -0.266175 0.078848 0.093847 0.078292 0.057237 0.061683 0.050463 0.082843 0.082866 0.069474 0.097160 0.097250 0.106504 0.139148 0.089374 0.076786 0.108466 0.106724 0.132764 0.094137 0.107802 0.130521 0.095551 0.081641 0.083732
qa: 0.8894 -0.3198 -0.4361 -0.4402 -0.3397 -0.3622 -0.1596 -0.2184 -0.1155 -0.1145 -0.1375 -0.0895 0.1493 0.3193 -0.2576 0.3975 -0.2885 -0.0080 -0.2170 -0.1882 -0.2662 0.0788 0.0938 0.0783 0.0572 0.0617 0.0505 0.0828 0.0829 0.0695 0.0972 0.0972 0.1065 0.1391 0.0894 0.0768 0.1085 0.1067 0.1328 0.0941 0.1078 0.1305 0.0956 0.0816 0.0837
va: 6.0397 2.0368 2.0371 2.0676 3.0715 2.9982 3.0710 3.1457 3.8344 3.8312 3.7385 3.8711 3.9231 4.0820 3.9552 4.1573 3.9220 3.8881 3.9268 3.9117 3.8988 1.0054 1.0199 1.0334 1.0152 1.0104 1.0081 1.0033 1.0055 1.0025 0.9985 0.9959 1.0249 1.0431 1.0005 1.0088 0.9990 0.9987 1.0047 0.9942 0.9940 1.0115 1.0072 1.0073 1.0131
dispcorr: -0.023881571 hartree
energy: -1352.860455471239
dipole: 7.33913 -7.77920 -0.44007 -2.23266 3.29424 1.06158 3.49870 -4.26066 -0.76196
magnitude: 1.37884 au
magnitude: 3.50472 debye
