program: Orca
programVersion: 4.2.1
elementType: S O O O N N N N C C C C C C C C C C C C C H H H H H H H H H H H H H H H H H H H H H H H H
charge: 0
multiplicity: 1
keywords: wb97x-d3
keywords: def2-TZVPP
keywords: def2/J RIJCOSX GRIDX6 NOFINALGRIDX
keywords: grid4 nofinalgrid
keywords: scfconv7
keywords: smallprint printgap noloewdin
keywords: NOSOSCF
formula: C13H24N4O3S
InChI: InChI=1/C13H24N4O3S/c1-6-8-9-11-10(3)15-13(14-7-2)16-12(11)20-21(18,19)17(4)5/h14H,6-9H2,1-5H3
45 atoms
S  -1.64378 -1.445527 0.048595
O  -0.491741 -0.840205 1.068339
O  -1.631042 -2.843247 0.376384
O  -1.370534 -0.961295 -1.276334
N  1.90778 2.266416 0.138639
N  -0.246487 1.309933 0.328461
N  -3.055111 -0.81952 0.57883
N  0.049981 3.475899 -0.398766
C  2.276615 -1.328133 1.25738
C  2.22322 -2.410655 0.173048
C  1.691242 -0.005915 0.846329
C  2.917685 -2.034257 -1.128237
C  2.453403 1.131564 0.544757
C  0.32408 0.195275 0.714038
C  2.817167 -3.134508 -2.17486
C  0.58077 2.30931 0.02896
C  3.947828 1.126582 0.655835
C  -1.319801 3.625979 -0.824372
C  -3.501024 -1.217376 1.904417
C  -3.421145 0.532163 0.19219
C  -1.619859 2.982805 -2.172173
H  1.760602 -1.699364 2.145582
H  3.315662 -1.182155 1.559237
H  1.185315 -2.67941 -0.033838
H  2.683286 -3.316976 0.578795
H  2.478329 -1.116222 -1.528524
H  3.971872 -1.811356 -0.93217
H  3.273147 -4.061638 -1.823603
H  1.775152 -3.351165 -2.414112
H  3.316237 -2.852203 -3.102005
H  4.391747 0.35633 0.024543
H  4.268547 0.926223 1.67943
H  4.34231 2.093119 0.354371
H  0.7279 4.151417 -0.706291
H  -1.971499 3.210643 -0.055645
H  -1.53057 4.695694 -0.861225
H  -3.031868 -0.624132 2.694293
H  -3.300386 -2.269812 2.079857
H  -4.579026 -1.069961 1.954136
H  -3.120106 0.733246 -0.830445
H  -4.506808 0.606255 0.248444
H  -2.974932 1.285211 0.84451
H  -1.008869 3.420701 -2.962251
H  -2.666372 3.130053 -2.443289
H  -1.423113 1.911223 -2.148137
totalener: -1352.83500976 hartree
nucrepener: 2109.65358868 hartree
electener: -3462.48859844 hartree
oneelecener: -6043.37451567 hartree
twoeener: 2580.88591723 hartree
kineticenergy: 1347.73984047 hartree
xcener: -110.801564465644 hartree
chargesum: -0.0000000
charge: 0.891129 -0.319359 -0.440681 -0.433042 -0.339887 -0.366833 -0.157004 -0.217665 -0.119688 -0.128356 -0.176166 -0.100960 0.172416 0.334073 -0.268364 0.393910 -0.293155 -0.013960 -0.187590 -0.217946 -0.263649 0.095708 0.082197 0.080593 0.070937 0.075470 0.048888 0.071197 0.086246 0.082173 0.105475 0.096925 0.105350 0.139330 0.077338 0.090142 0.106186 0.131093 0.095091 0.133652 0.109887 0.107498 0.083008 0.081309 0.097087
qa: 0.8911 -0.3194 -0.4407 -0.4330 -0.3399 -0.3668 -0.1570 -0.2177 -0.1197 -0.1284 -0.1762 -0.1010 0.1724 0.3341 -0.2684 0.3939 -0.2932 -0.0140 -0.1876 -0.2179 -0.2636 0.0957 0.0822 0.0806 0.0709 0.0755 0.0489 0.0712 0.0862 0.0822 0.1055 0.0969 0.1054 0.1393 0.0773 0.0901 0.1062 0.1311 0.0951 0.1337 0.1099 0.1075 0.0830 0.0813 0.0971
va: 6.0347 2.0435 2.0642 2.0450 3.0672 2.9899 3.0660 3.1429 3.8453 3.8470 3.7107 3.8675 3.8769 4.0665 3.9744 4.1678 3.9123 3.8959 3.9105 3.9254 3.8961 1.0149 1.0050 1.0296 1.0155 1.0022 1.0045 1.0022 1.0042 1.0044 0.9956 0.9970 1.0265 1.0434 1.0074 1.0006 0.9935 1.0119 0.9943 1.0049 0.9983 0.9970 1.0133 1.0078 1.0071
dispcorr: -0.024988551 hartree
energy: -1352.859998313063
dipole: 7.43873 -7.86656 -0.42783 1.28785 -0.03498 1.25287 -5.87867 6.47231 0.59364
magnitude: 1.45091 au
magnitude: 3.68791 debye
