program: Orca
programVersion: 4.2.1
elementType: S O O O N N N N C C C C C C C C C C C C C H H H H H H H H H H H H H H H H H H H H H H H H
charge: 0
multiplicity: 1
keywords: wb97x-d3
keywords: def2-TZVPP
keywords: def2/J RIJCOSX GRIDX6 NOFINALGRIDX
keywords: grid4 nofinalgrid
keywords: scfconv7
keywords: smallprint printgap noloewdin
keywords: NOSOSCF
formula: C13H24N4O3S
InChI: InChI=1/C13H24N4O3S/c1-6-8-9-11-10(3)15-13(14-7-2)16-12(11)20-21(18,19)17(4)5/h14H,6-9H2,1-5H3
45 atoms
S  -1.680428 -1.301827 -0.306452
O  -0.68884 -0.662394 0.844976
O  -1.620403 -2.712522 -0.048459
O  -1.309292 -0.730828 -1.573197
N  1.884177 2.357761 0.0870
N  -0.318607 1.527835 0.326491
N  -3.169947 -0.768226 0.109041
N  0.084347 3.743577 -0.149808
C  2.06313 -1.355232 0.738812
C  2.194303 -2.109108 -0.589502
C  1.544605 0.040105 0.555391
C  2.567595 -3.577733 -0.422408
C  2.36852 1.149571 0.316934
C  0.192685 0.341519 0.545397
C  3.924898 -3.805579 0.22924
C  0.55794 2.500508 0.088903
C  3.859961 1.014028 0.307726
C  -1.301165 4.02735 -0.432857
C  -3.708384 -1.25168 1.371418
C  -3.504377 0.613152 -0.203197
C  -1.740064 3.604836 -1.828843
H  1.398326 -1.915628 1.399327
H  3.029425 -1.321737 1.246211
H  2.936247 -1.608996 -1.22134
H  1.249871 -2.042628 -1.133528
H  1.78776 -4.078872 0.158387
H  2.557957 -4.052486 -1.406635
H  4.718237 -3.295712 -0.321222
H  3.953905 -3.444019 1.257789
H  4.175987 -4.866066 0.256638
H  4.23258 0.721439 1.291186
H  4.31866 1.960302 0.034057
H  4.186783 0.248519 -0.396857
H  0.782625 4.408878 -0.433187
H  -1.917232 3.534638 0.319502
H  -1.44771 5.099997 -0.298233
H  -4.790411 -1.131849 1.34206
H  -3.319199 -0.696408 2.229543
H  -3.493896 -2.308035 1.501577
H  -3.04081 1.322151 0.486174
H  -3.20156 0.859348 -1.21585
H  -4.587652 0.707521 -0.14233
H  -1.590696 2.535427 -1.975395
H  -1.174941 4.132154 -2.59804
H  -2.797303 3.825246 -1.983454
totalener: -1352.83521388 hartree
nucrepener: 2087.26922093 hartree
electener: -3440.10443481 hartree
oneelecener: -5998.58287697 hartree
twoeener: 2558.47844217 hartree
kineticenergy: 1347.74184428 hartree
xcener: -110.799275626186 hartree
chargesum: -0.0000000
charge: 0.887136 -0.318692 -0.438118 -0.437777 -0.340155 -0.362402 -0.163133 -0.218345 -0.133110 -0.129520 -0.132145 -0.108635 0.143599 0.316391 -0.262375 0.402860 -0.285485 -0.012813 -0.188799 -0.217791 -0.260603 0.100468 0.080023 0.068465 0.094033 0.065673 0.067892 0.073890 0.072755 0.089351 0.096806 0.106912 0.096988 0.139048 0.079847 0.089965 0.094846 0.107717 0.130164 0.112339 0.130279 0.105798 0.091376 0.083660 0.081619
qa: 0.8871 -0.3187 -0.4381 -0.4378 -0.3402 -0.3624 -0.1631 -0.2183 -0.1331 -0.1295 -0.1321 -0.1086 0.1436 0.3164 -0.2624 0.4029 -0.2855 -0.0128 -0.1888 -0.2178 -0.2606 0.1005 0.0800 0.0685 0.0940 0.0657 0.0679 0.0739 0.0728 0.0894 0.0968 0.1069 0.0970 0.1390 0.0798 0.0900 0.0948 0.1077 0.1302 0.1123 0.1303 0.1058 0.0914 0.0837 0.0816
va: 6.0379 2.0331 2.0674 2.0334 3.0723 3.0066 3.0667 3.1467 3.8276 3.8504 3.7269 3.8769 3.9335 4.1033 3.9228 4.1473 3.9211 3.8875 3.9106 3.9225 3.9007 1.0176 1.0033 1.0124 1.0374 1.0138 1.0093 1.0016 1.0010 1.0069 0.9985 1.0251 0.9980 1.0432 1.0084 1.0005 0.9952 0.9937 1.0116 1.0002 1.0041 0.9993 1.0079 1.0132 1.0078
dispcorr: -0.024355710 hartree
energy: -1352.859569587621
dipole: 8.65100 -9.13860 -0.48760 -1.41720 2.54850 1.13130 -0.75555 1.30648 0.55092
magnitude: 1.34948 au
magnitude: 3.43012 debye
