program: Orca
programVersion: 4.2.1
elementType: S O O O N N N N C C C C C C C C C C C C C H H H H H H H H H H H H H H H H H H H H H H H H
charge: 0
multiplicity: 1
keywords: wb97x-d3
keywords: def2-TZVPP
keywords: def2/J RIJCOSX GRIDX6 NOFINALGRIDX
keywords: grid4 nofinalgrid
keywords: scfconv7
keywords: smallprint printgap noloewdin
keywords: NOSOSCF
formula: C13H24N4O3S
InChI: InChI=1/C13H24N4O3S/c1-6-8-9-11-10(3)15-13(14-7-2)16-12(11)20-21(18,19)17(4)5/h14H,6-9H2,1-5H3
45 atoms
S  -1.621802 -1.966787 0.29568
O  -0.36979 -1.30089 -0.547412
O  -1.344783 -1.777304 1.695222
O  -1.710189 -3.263052 -0.312624
N  1.116555 2.311757 0.478921
N  -0.567228 0.956749 -0.476605
N  -2.947409 -1.105585 -0.093074
N  -0.782342 3.23119 -0.439145
C  2.169032 -1.294113 0.831479
C  3.243994 -1.641717 -0.207088
C  1.372605 -0.067708 0.489505
C  2.717495 -2.15571 -1.543955
C  1.810864 1.227713 0.794155
C  0.144164 -0.096744 -0.15733
C  2.076156 -3.534246 -1.465788
C  -0.047059 2.137834 -0.139019
C  3.093882 1.461338 1.530498
C  -0.30704 4.584424 -0.27434
C  -3.390345 0.002509 0.735532
C  -3.306341 -1.021415 -1.497385
C  0.653908 5.038589 -1.363886
H  1.506557 -2.146306 0.984137
H  2.656129 -1.137784 1.796648
H  3.908546 -2.39675 0.224451
H  3.867754 -0.760233 -0.383754
H  2.010901 -1.438944 -1.970514
H  3.554968 -2.194943 -2.245667
H  1.187912 -3.547584 -0.83605
H  1.766914 -3.877384 -2.453122
H  2.778324 -4.269832 -1.068688
H  3.02811 1.076219 2.550163
H  3.304114 2.526215 1.581642
H  3.935578 0.958043 1.055507
H  -1.577525 3.065965 -1.030808
H  -1.183188 5.234221 -0.247401
H  0.173347 4.663294 0.700094
H  -4.479941 0.028185 0.702424
H  -2.997673 0.956825 0.382684
H  -3.090041 -0.1438 1.767876
H  -4.386602 -0.897986 -1.568812
H  -2.815937 -0.175148 -1.983958
H  -3.044198 -1.937413 -2.020032
H  0.966183 6.069388 -1.192822
H  0.19079 4.990238 -2.350066
H  1.546693 4.414877 -1.373619
totalener: -1352.83500242 hartree
nucrepener: 2096.91125575 hartree
electener: -3449.74625817 hartree
oneelecener: -6017.76910683 hartree
twoeener: 2568.02284865 hartree
kineticenergy: 1347.73991795 hartree
xcener: -110.802834569831 hartree
chargesum: -0.0000000
charge: 0.869485 -0.306896 -0.443766 -0.435544 -0.367081 -0.388162 -0.151426 -0.226007 -0.148833 -0.133895 -0.060107 -0.114643 0.137948 0.278495 -0.238182 0.441353 -0.289815 0.004184 -0.194303 -0.178266 -0.244999 0.095747 0.090236 0.073419 0.072256 0.061079 0.069977 0.079223 0.079592 0.070013 0.100397 0.106690 0.098797 0.137087 0.081767 0.080899 0.105128 0.094806 0.130675 0.096445 0.099042 0.124528 0.079343 0.070033 0.093283
qa: 0.8695 -0.3069 -0.4438 -0.4355 -0.3671 -0.3882 -0.1514 -0.2260 -0.1488 -0.1339 -0.0601 -0.1146 0.1379 0.2785 -0.2382 0.4414 -0.2898 0.0042 -0.1943 -0.1783 -0.2450 0.0957 0.0902 0.0734 0.0723 0.0611 0.0700 0.0792 0.0796 0.0700 0.1004 0.1067 0.0988 0.1371 0.0818 0.0809 0.1051 0.0948 0.1307 0.0964 0.0990 0.1245 0.0793 0.0700 0.0933
va: 6.0622 2.0329 2.0411 2.0714 3.0314 2.9930 3.0710 3.1660 3.8472 3.8847 3.6490 3.8856 3.9122 4.0948 3.9315 4.0551 3.9214 3.8815 3.9060 3.8963 3.9057 1.0291 1.0081 1.0105 1.0128 1.0135 1.0055 1.0189 1.0080 1.0041 0.9986 1.0222 0.9994 1.0380 0.9971 1.0214 0.9940 0.9963 1.0123 0.9946 1.0057 1.0135 1.0114 1.0092 1.0120
dispcorr: -0.024430457 hartree
energy: -1352.859432879069
dipole: 13.10216 -13.36103 -0.25888 10.20862 -8.37363 1.83499 -6.93619 6.46018 -0.47601
magnitude: 1.91332 au
magnitude: 4.86327 debye
