program: Orca
programVersion: 4.2.1
elementType: S O O O N N N N C C C C C C C C C C C C C H H H H H H H H H H H H H H H H H H H H H H H H
charge: 0
multiplicity: 1
keywords: wb97x-d3
keywords: def2-TZVPP
keywords: def2/J RIJCOSX GRIDX6 NOFINALGRIDX
keywords: grid4 nofinalgrid
keywords: scfconv7
keywords: smallprint printgap noloewdin
keywords: NOSOSCF
formula: C13H24N4O3S
InChI: InChI=1/C13H24N4O3S/c1-6-8-9-11-10(3)15-13(14-7-2)16-12(11)20-21(18,19)17(4)5/h14H,6-9H2,1-5H3
45 atoms
S  -1.944781 -1.071669 -1.127318
O  -0.37141 -1.057683 -0.602385
O  -2.040628 -2.409974 -1.633879
O  -2.185424 0.084111 -1.941446
N  1.947395 2.192994 -0.054534
N  -0.190385 1.177739 -0.102858
N  -2.84645 -0.983414 0.23121
N  0.072373 3.435357 0.284364
C  2.360164 -1.474758 -0.89337
C  2.375802 -2.467358 0.274511
C  1.766821 -0.136029 -0.556514
C  3.231711 -2.03414 1.456623
C  2.510555 1.028704 -0.340305
C  0.393117 0.049518 -0.421092
C  3.184155 -3.027461 2.608703
C  0.619502 2.227671 0.038845
C  4.005325 1.03633 -0.449481
C  -1.33568 3.701065 0.42093
C  -2.717162 -2.070486 1.186671
C  -3.159692 0.309124 0.811898
C  -1.835118 3.600056 1.85584
H  3.380625 -1.3410 -1.258653
H  1.805546 -1.920238 -1.722153
H  2.739176 -3.430045 -0.09802
H  1.351884 -2.647242 0.612232
H  4.268558 -1.908483 1.128479
H  2.90233 -1.052877 1.81097
H  3.805497 -2.704296 3.444114
H  2.166054 -3.147253 2.982892
H  3.535549 -4.012804 2.298457
H  4.461865 0.317977 0.231344
H  4.385528 2.027569 -0.217781
H  4.327885 0.771974 -1.458035
H  0.733307 4.179274 0.423082
H  -1.526855 4.702808 0.031227
H  -1.87868 3.009905 -0.222883
H  -3.628203 -2.107263 1.782617
H  -1.867295 -1.929508 1.860916
H  -2.614341 -3.023631 0.676989
H  -3.259935 1.063278 0.038951
H  -4.115288 0.21827 1.328239
H  -2.399832 0.636574 1.522982
H  -1.342742 4.329205 2.499944
H  -1.640462 2.609446 2.26534
H  -2.909307 3.783315 1.906138
totalener: -1352.83359170 hartree
nucrepener: 2083.41420637 hartree
electener: -3436.24779806 hartree
oneelecener: -5990.63820679 hartree
twoeener: 2554.39040872 hartree
kineticenergy: 1347.74543178 hartree
xcener: -110.804106590278 hartree
chargesum: 0.0000000
charge: 0.875340 -0.297695 -0.433731 -0.420651 -0.348259 -0.379550 -0.161233 -0.209987 -0.106044 -0.118720 -0.190245 -0.102142 0.165496 0.342155 -0.265933 0.401867 -0.294970 -0.033442 -0.189873 -0.210527 -0.258832 0.081042 0.099657 0.072467 0.070111 0.051559 0.068119 0.085838 0.072348 0.075505 0.104936 0.106159 0.098144 0.139764 0.093919 0.093029 0.099032 0.099460 0.131948 0.128818 0.110932 0.101382 0.085143 0.081510 0.086151
qa: 0.8753 -0.2977 -0.4337 -0.4207 -0.3483 -0.3795 -0.1612 -0.2100 -0.1060 -0.1187 -0.1902 -0.1021 0.1655 0.3422 -0.2659 0.4019 -0.2950 -0.0334 -0.1899 -0.2105 -0.2588 0.0810 0.0997 0.0725 0.0701 0.0516 0.0681 0.0858 0.0723 0.0755 0.1049 0.1062 0.0981 0.1398 0.0939 0.0930 0.0990 0.0995 0.1319 0.1288 0.1109 0.1014 0.0851 0.0815 0.0862
va: 6.0761 2.0825 2.0757 2.0645 3.0628 2.9926 3.0441 3.1406 3.8245 3.8455 3.6985 3.8642 3.8872 4.0377 3.9716 4.1563 3.9110 3.8877 3.9137 3.9417 3.8972 1.0071 1.0208 1.0134 1.0154 1.0027 1.0014 1.0046 1.0036 1.0031 0.9949 1.0265 0.9971 1.0444 0.9999 1.0124 0.9951 0.9936 1.0121 1.0056 0.9977 0.9893 1.0117 1.0053 1.0084
dispcorr: -0.023852521 hartree
energy: -1352.857444217993
dipole: 11.91158 -11.75899 0.15259 -1.49275 2.16007 0.66732 20.76888 -19.13442 1.63445
magnitude: 1.77202 au
magnitude: 4.50411 debye
