program: Orca
programVersion: 4.2.1
elementType: S O O O N N N N C C C C C C C C C C C C C H H H H H H H H H H H H H H H H H H H H H H H H
charge: 0
multiplicity: 1
keywords: wb97x-d3
keywords: def2-TZVPP
keywords: def2/J RIJCOSX GRIDX6 NOFINALGRIDX
keywords: grid4 nofinalgrid
keywords: scfconv7
keywords: smallprint printgap noloewdin
keywords: NOSOSCF
formula: C13H24N4O3S
InChI: InChI=1/C13H24N4O3S/c1-6-8-9-11-10(3)15-13(14-7-2)16-12(11)20-21(18,19)17(4)5/h14H,6-9H2,1-5H3
45 atoms
S  -1.901248 -1.068515 1.024895
O  -0.265835 -0.979219 0.756735
O  -2.317903 0.003732 1.881006
O  -2.008167 -2.445682 1.410875
N  1.840741 2.326295 -0.187319
N  -0.224569 1.266319 0.271375
N  -2.580535 -0.891444 -0.44535
N  -0.084717 3.536861 -0.101891
C  2.486982 -1.334735 0.484664
C  2.455701 -2.186285 -0.786087
C  1.803442 -0.009737 0.31823
C  3.1731 -3.51924 -0.621634
C  2.465585 1.167156 -0.038676
C  0.42502 0.144101 0.446675
C  3.131312 -4.369282 -1.882945
C  0.521794 2.336615 -0.00319
C  3.947553 1.183319 -0.260704
C  -1.474807 3.807006 0.163625
C  -2.241846 -1.862038 -1.469826
C  -3.018456 0.404597 -0.925981
C  -2.276115 4.095988 -1.097771
H  2.026245 -1.893547 1.302091
H  3.525927 -1.176948 0.784674
H  2.906285 -1.625903 -1.612178
H  1.415548 -2.365574 -1.074353
H  4.213815 -3.339084 -0.334758
H  2.722732 -4.071509 0.208267
H  3.60045 -3.855494 -2.723715
H  3.651935 -5.316951 -1.745065
H  2.104029 -4.598082 -2.171126
H  4.255225 2.156411 -0.634003
H  4.256646 0.418983 -0.974516
H  4.484967 0.989121 0.669412
H  0.531468 4.302132 -0.314658
H  -1.887877 2.951194 0.694835
H  -1.542429 4.658303 0.84615
H  -2.059612 -2.839703 -1.033391
H  -1.36494 -1.558976 -2.04936
H  -3.089104 -1.954313 -2.14869
H  -2.259671 0.893279 -1.538923
H  -3.916857 0.252504 -1.525172
H  -3.268918 1.057429 -0.097445
H  -2.238325 3.253705 -1.788284
H  -1.892671 4.971968 -1.622417
H  -3.321407 4.289303 -0.854038
totalener: -1352.83462814 hartree
nucrepener: 2067.54796429 hartree
electener: -3420.38259243 hartree
oneelecener: -5958.81436393 hartree
twoeener: 2538.43177150 hartree
kineticenergy: 1347.74622280 hartree
xcener: -110.804910527956 hartree
chargesum: -0.0000000
charge: 0.861795 -0.280966 -0.419394 -0.432708 -0.350795 -0.392071 -0.162799 -0.200139 -0.105207 -0.106164 -0.163523 -0.092470 0.158144 0.337106 -0.256616 0.392267 -0.289503 -0.044726 -0.190966 -0.202021 -0.241593 0.092939 0.080059 0.057768 0.061140 0.053939 0.062341 0.071644 0.087032 0.072913 0.105859 0.094296 0.098668 0.138011 0.100554 0.094262 0.130557 0.095938 0.105244 0.098504 0.113071 0.127518 0.073474 0.080871 0.085748
qa: 0.8618 -0.2810 -0.4194 -0.4327 -0.3508 -0.3921 -0.1628 -0.2001 -0.1052 -0.1062 -0.1635 -0.0925 0.1581 0.3371 -0.2566 0.3923 -0.2895 -0.0447 -0.1910 -0.2020 -0.2416 0.0929 0.0801 0.0578 0.0611 0.0539 0.0623 0.0716 0.0870 0.0729 0.1059 0.0943 0.0987 0.1380 0.1006 0.0943 0.1306 0.0959 0.1052 0.0985 0.1131 0.1275 0.0735 0.0809 0.0857
va: 6.0934 2.1015 2.0638 2.0758 3.0642 2.9762 3.0460 3.1341 3.8221 3.8419 3.7187 3.8780 3.9207 4.0293 3.9515 4.1715 3.9243 3.8768 3.9097 3.9347 3.9138 1.0223 1.0047 1.0135 1.0165 1.0089 1.0084 1.0025 1.0063 1.0033 1.0253 0.9955 0.9980 1.0447 1.0146 0.9993 1.0124 0.9917 0.9965 0.9896 0.9962 1.0062 1.0088 1.0098 1.0096
dispcorr: -0.023261142 hartree
energy: -1352.857889283830
dipole: 11.98610 -11.68492 0.30118 -3.56148 4.33962 0.77814 -18.71004 17.09741 -1.61263
magnitude: 1.81570 au
magnitude: 4.61515 debye
