program: Orca
programVersion: 4.2.1
elementType: S O O O N N N N C C C C C C C C C C C C C H H H H H H H H H H H H H H H H H H H H H H H H
charge: 0
multiplicity: 1
keywords: wb97x-d3
keywords: def2-TZVPP
keywords: def2/J RIJCOSX GRIDX6 NOFINALGRIDX
keywords: grid4 nofinalgrid
keywords: scfconv7
keywords: smallprint printgap noloewdin
keywords: NOSOSCF
formula: C13H24N4O3S
InChI: InChI=1/C13H24N4O3S/c1-6-8-9-11-10(3)15-13(14-7-2)16-12(11)20-21(18,19)17(4)5/h14H,6-9H2,1-5H3
45 atoms
S  -1.87504 -1.142721 1.158068
O  -0.220763 -1.047541 1.052503
O  -2.385257 -0.050532 1.934118
O  -2.011592 -2.508041 1.575361
N  1.905052 2.180504 -0.08838
N  -0.161315 1.16662 0.454562
N  -2.399301 -1.014651 -0.379479
N  -0.00888 3.412656 -0.03479
C  2.505598 -1.479418 0.676275
C  2.238127 -2.485623 -0.449005
C  1.847472 -0.143084 0.477492
C  2.71482 -2.03473 -1.823175
C  2.519372 1.018434 0.084683
C  0.476826 0.041863 0.651313
C  2.383031 -3.04305 -2.913856
C  0.589358 2.213558 0.112776
C  3.998997 1.022588 -0.155519
C  -1.395472 3.70373 0.228907
C  -1.954547 -2.011661 -1.335061
C  -2.811198 0.25666 -0.942052
C  -2.20898 3.927551 -1.037999
H  2.172813 -1.91587 1.620579
H  3.583849 -1.341943 0.780049
H  1.168824 -2.709148 -0.490804
H  2.727234 -3.429583 -0.189974
H  2.263384 -1.069745 -2.071645
H  3.796412 -1.867693 -1.799357
H  2.846683 -4.01062 -2.715762
H  1.305886 -3.207225 -2.983601
H  2.728083 -2.706314 -3.891541
H  4.31461 2.008692 -0.485227
H  4.284153 0.292289 -0.913041
H  4.547365 0.772258 0.754133
H  0.609381 4.162287 -0.292391
H  -1.808011 2.880621 0.810313
H  -1.451778 4.59199 0.863485
H  -2.727802 -2.130068 -2.093737
H  -1.812286 -2.975133 -0.854328
H  -1.024849 -1.7173 -1.831863
H  -3.690387 0.083937 -1.564278
H  -3.078023 0.957776 -0.159477
H  -2.025235 0.702173 -1.553947
H  -1.8247 4.768368 -1.616701
H  -3.249708 4.143332 -0.793627
H  -2.187196 3.046851 -1.679309
totalener: -1352.83272312 hartree
nucrepener: 2102.82653902 hartree
electener: -3455.65926214 hartree
oneelecener: -6029.24876953 hartree
twoeener: 2573.58950739 hartree
kineticenergy: 1347.74646574 hartree
xcener: -110.807301367371 hartree
chargesum: -0.0000000
charge: 0.859471 -0.277488 -0.417709 -0.432258 -0.348032 -0.386180 -0.158041 -0.198745 -0.108092 -0.132139 -0.185415 -0.115488 0.176739 0.326412 -0.260304 0.391210 -0.294148 -0.044036 -0.196895 -0.206788 -0.244000 0.099380 0.082533 0.069004 0.077920 0.071074 0.058997 0.079110 0.067155 0.086673 0.105732 0.102838 0.098437 0.138161 0.102165 0.093888 0.109662 0.132963 0.090026 0.115201 0.132323 0.097566 0.081038 0.087160 0.072920
qa: 0.8595 -0.2775 -0.4177 -0.4323 -0.3480 -0.3862 -0.1580 -0.1987 -0.1081 -0.1321 -0.1854 -0.1155 0.1767 0.3264 -0.2603 0.3912 -0.2941 -0.0440 -0.1969 -0.2068 -0.2440 0.0994 0.0825 0.0690 0.0779 0.0711 0.0590 0.0791 0.0672 0.0867 0.1057 0.1028 0.0984 0.1382 0.1022 0.0939 0.1097 0.1330 0.0900 0.1152 0.1323 0.0976 0.0810 0.0872 0.0729
va: 6.0925 2.1077 2.0661 2.0746 3.0615 2.9697 3.0415 3.1333 3.8330 3.8499 3.6778 3.8628 3.8704 4.0354 3.9696 4.1678 3.9113 3.8705 3.9173 3.9400 3.9149 1.0167 1.0058 1.0135 1.0160 0.9997 1.0044 1.0029 1.0035 1.0052 1.0268 0.9953 0.9968 1.0445 1.0159 0.9993 0.9979 1.0100 0.9898 0.9962 1.0039 0.9847 1.0099 1.0095 1.0088
dispcorr: -0.025138918 hartree
energy: -1352.857862042157
dipole: 10.79735 -10.34392 0.45343 -0.42619 1.17660 0.75041 -22.32359 20.64113 -1.68245
magnitude: 1.89720 au
magnitude: 4.82230 debye
