program: Orca
programVersion: 4.2.1
elementType: S O O O N N N N C C C C C C C C C C C C C H H H H H H H H H H H H H H H H H H H H H H H H
charge: 0
multiplicity: 1
keywords: wb97x-d3
keywords: def2-TZVPP
keywords: def2/J RIJCOSX GRIDX6 NOFINALGRIDX
keywords: grid4 nofinalgrid
keywords: scfconv7
keywords: smallprint printgap noloewdin
keywords: NOSOSCF
formula: C13H24N4O3S
InChI: InChI=1/C13H24N4O3S/c1-6-8-9-11-10(3)15-13(14-7-2)16-12(11)20-21(18,19)17(4)5/h14H,6-9H2,1-5H3
45 atoms
S  -1.765795 -1.456605 0.045665
O  -0.570598 -0.828073 -0.908687
O  -1.474301 -1.106129 1.407777
O  -1.827787 -2.816434 -0.408926
N  1.912471 2.128671 0.256589
N  -0.268783 1.278963 -0.078591
N  -3.139572 -0.708035 -0.424377
N  0.087242 3.394883 0.760694
C  2.1721 -1.456697 -0.935624
C  2.035076 -2.551894 0.1308
C  1.634867 -0.117443 -0.512106
C  2.881442 -2.337812 1.381753
C  2.429075 0.978885 -0.144885
C  0.272486 0.147388 -0.459398
C  4.364417 -2.613472 1.169815
C  0.584535 2.229226 0.298233
C  3.925526 0.917776 -0.185117
C  -1.312162 3.732239 0.795427
C  -3.600655 -0.955009 -1.78027
C  -3.439638 0.616653 0.089824
C  -1.875914 4.162438 -0.552157
H  3.220015 -1.355456 -1.224964
H  1.651755 -1.787094 -1.836899
H  2.303362 -3.510037 -0.324809
H  0.987239 -2.649275 0.415718
H  2.731517 -1.321897 1.759656
H  2.512643 -2.997377 2.170645
H  4.530721 -3.657184 0.898037
H  4.792207 -2.003448 0.372513
H  4.94081 -2.414832 2.073806
H  4.289508 0.638398 -1.174774
H  4.310929 0.179156 0.518286
H  4.338856 1.888331 0.075619
H  0.773243 4.103138 0.952632
H  -1.868978 2.877823 1.180728
H  -1.43549 4.533803 1.525127
H  -3.449207 -1.9939 -2.057028
H  -3.101731 -0.311057 -2.510037
H  -4.670577 -0.753251 -1.814202
H  -2.98962 1.405413 -0.515559
H  -4.523086 0.734879 0.087137
H  -3.089125 0.71867 1.111614
H  -1.764022 3.369103 -1.2904
H  -1.364208 5.047893 -0.929901
H  -2.937178 4.400284 -0.467808
totalener: -1352.83333466 hartree
nucrepener: 2097.28117816 hartree
electener: -3450.11451282 hartree
oneelecener: -6018.56080569 hartree
twoeener: 2568.44629287 hartree
kineticenergy: 1347.74150132 hartree
xcener: -110.803468479590 hartree
chargesum: 0.0000000
charge: 0.886884 -0.317574 -0.430557 -0.439586 -0.342465 -0.367459 -0.159614 -0.214195 -0.128835 -0.118174 -0.158912 -0.137308 0.161663 0.322780 -0.260970 0.413692 -0.306225 -0.032632 -0.187633 -0.218421 -0.254100 0.079520 0.095872 0.066930 0.094374 0.071794 0.079593 0.080626 0.062926 0.092038 0.100320 0.103886 0.109444 0.139954 0.084546 0.091843 0.130652 0.105762 0.095234 0.108337 0.110657 0.131403 0.084511 0.084206 0.085214
qa: 0.8869 -0.3176 -0.4306 -0.4396 -0.3425 -0.3675 -0.1596 -0.2142 -0.1288 -0.1182 -0.1589 -0.1373 0.1617 0.3228 -0.2610 0.4137 -0.3062 -0.0326 -0.1876 -0.2184 -0.2541 0.0795 0.0959 0.0669 0.0944 0.0718 0.0796 0.0806 0.0629 0.0920 0.1003 0.1039 0.1094 0.1400 0.0845 0.0918 0.1307 0.1058 0.0952 0.1083 0.1107 0.1314 0.0845 0.0842 0.0852
va: 6.0512 2.0394 2.0491 2.0665 3.0679 2.9913 3.0695 3.1413 3.8539 3.8539 3.7045 3.8870 3.8671 4.0831 3.9168 4.1315 3.9138 3.9101 3.9119 3.9360 3.8749 1.0035 1.0172 1.0143 1.0355 1.0033 1.0106 1.0055 1.0013 1.0050 0.9948 0.9926 1.0291 1.0441 1.0072 1.0013 1.0123 0.9931 0.9936 0.9839 0.9982 1.0084 1.0097 1.0128 1.0081
dispcorr: -0.024852496 hartree
energy: -1352.858187152415
dipole: 10.04933 -10.42885 -0.37952 4.76535 -3.29980 1.46555 -0.98590 0.34407 -0.64183
magnitude: 1.64433 au
magnitude: 4.17956 debye
