program: Orca
programVersion: 4.2.1
elementType: S O O O N N N N C C C C C C C C C C C C C H H H H H H H H H H H H H H H H H H H H H H H H
charge: 0
multiplicity: 1
keywords: wb97x-d3
keywords: def2-TZVPP
keywords: def2/J RIJCOSX GRIDX6 NOFINALGRIDX
keywords: grid4 nofinalgrid
keywords: scfconv7
keywords: smallprint printgap noloewdin
keywords: NOSOSCF
formula: C13H24N4O3S
InChI: InChI=1/C13H24N4O3S/c1-6-8-9-11-10(3)15-13(14-7-2)16-12(11)20-21(18,19)17(4)5/h14H,6-9H2,1-5H3
45 atoms
S  -1.586569 -1.552394 -0.35143
O  -0.477372 -0.664394 -1.192015
O  -0.971628 -1.969702 0.882266
O  -2.008003 -2.475816 -1.363835
N  1.772455 2.248414 0.460842
N  -0.330681 1.340424 -0.119417
N  -2.817469 -0.552781 0.011056
N  -0.143494 3.40977 0.885696
C  2.332277 -1.102916 -1.200938
C  2.284907 -2.370034 -0.340715
C  1.671291 0.106748 -0.598809
C  2.904768 -2.224538 1.041223
C  2.376419 1.176974 -0.026367
C  0.295155 0.284528 -0.588861
C  2.769261 -3.495067 1.867738
C  0.443465 2.295044 0.390817
C  3.872166 1.178363 0.05446
C  -1.507552 3.793527 0.613482
C  -2.934587 0.022696 1.33869
C  -3.426676 0.191102 -1.075362
C  -1.747796 4.265608 -0.813903
H  3.374817 -0.865227 -1.422445
H  1.87059 -1.322526 -2.165991
H  2.801395 -3.165463 -0.886699
H  1.253193 -2.705564 -0.232672
H  3.963366 -1.960567 0.945664
H  2.424936 -1.398689 1.573728
H  3.222845 -3.383061 2.85278
H  1.719008 -3.751032 2.013226
H  3.251233 -4.342612 1.377347
H  4.244377 0.300285 0.581571
H  4.211126 2.069385 0.575816
H  4.321723 1.169812 -0.940073
H  0.508272 4.130516 1.144651
H  -2.164337 2.95446 0.84022
H  -1.766016 4.582989 1.320446
H  -2.368174 0.947416 1.442161
H  -2.603207 -0.681873 2.094105
H  -3.990822 0.227907 1.512725
H  -3.404007 -0.384976 -1.997142
H  -4.471999 0.371684 -0.826793
H  -2.925023 1.148259 -1.236897
H  -1.130196 5.131285 -1.05523
H  -2.791131 4.551838 -0.952574
H  -1.518084 3.476028 -1.528851
totalener: -1352.83409920 hartree
nucrepener: 2111.34624895 hartree
electener: -3464.18034815 hartree
oneelecener: -6046.52813912 hartree
twoeener: 2582.34779097 hartree
kineticenergy: 1347.74228516 hartree
xcener: -110.805111974372 hartree
chargesum: -0.0000000
charge: 0.879515 -0.306935 -0.453087 -0.429161 -0.336681 -0.394154 -0.145777 -0.217698 -0.127268 -0.140994 -0.139623 -0.099555 0.168761 0.316318 -0.270971 0.401390 -0.292474 -0.012835 -0.203416 -0.180863 -0.249827 0.082781 0.100653 0.073420 0.084766 0.051559 0.073291 0.080899 0.089752 0.071055 0.110920 0.106039 0.096177 0.139254 0.073808 0.089706 0.102054 0.134948 0.100777 0.127730 0.098018 0.093567 0.084051 0.082691 0.087417
qa: 0.8795 -0.3069 -0.4531 -0.4292 -0.3367 -0.3942 -0.1458 -0.2177 -0.1273 -0.1410 -0.1396 -0.0996 0.1688 0.3163 -0.2710 0.4014 -0.2925 -0.0128 -0.2034 -0.1809 -0.2498 0.0828 0.1007 0.0734 0.0848 0.0516 0.0733 0.0809 0.0898 0.0711 0.1109 0.1060 0.0962 0.1393 0.0738 0.0897 0.1021 0.1349 0.1008 0.1277 0.0980 0.0936 0.0841 0.0827 0.0874
va: 6.0521 2.0588 2.0275 2.0841 3.0737 2.9936 3.0704 3.1312 3.8482 3.8529 3.6867 3.8595 3.8709 4.0568 3.9723 4.1436 3.9058 3.9203 3.9153 3.9102 3.8928 1.0051 1.0134 1.0160 1.0305 1.0033 1.0042 1.0044 1.0045 1.0022 0.9967 1.0262 0.9974 1.0434 0.9973 1.0023 0.9833 1.0124 0.9914 1.0128 0.9965 0.9902 1.0109 1.0098 1.0094
dispcorr: -0.025318809 hartree
energy: -1352.859418004489
dipole: 8.04078 -8.26703 -0.22625 5.56634 -3.68704 1.87930 5.25819 -5.06227 0.19591
magnitude: 1.90298 au
magnitude: 4.83699 debye
