program: Orca
programVersion: 4.2.1
elementType: S O O O N N N N C C C C C C C C C C C C C H H H H H H H H H H H H H H H H H H H H H H H H
charge: 0
multiplicity: 1
keywords: wb97x-d3
keywords: def2-TZVPP
keywords: def2/J RIJCOSX GRIDX6 NOFINALGRIDX
keywords: grid4 nofinalgrid
keywords: scfconv7
keywords: smallprint printgap noloewdin
keywords: NOSOSCF
formula: C13H24N4O3S
InChI: InChI=1/C13H24N4O3S/c1-6-8-9-11-10(3)15-13(14-7-2)16-12(11)20-21(18,19)17(4)5/h14H,6-9H2,1-5H3
45 atoms
S  -1.699191 -1.482919 -0.855805
O  -0.63734 -0.92025 0.272769
O  -1.783836 -2.881369 -0.547815
O  -1.266135 -0.989377 -2.135505
N  1.876767 2.150217 -0.47896
N  -0.253962 1.315119 0.120569
N  -3.129286 -0.789192 -0.476914
N  0.168015 3.575946 0.018103
C  1.995111 -1.629447 -0.550521
C  2.22386 -2.351457 0.78123
C  1.518176 -0.211357 -0.408553
C  3.300238 -1.721806 1.655178
C  2.325493 0.915539 -0.628015
C  0.22216 0.102764 -0.031557
C  3.470252 -2.445618 2.983185
C  0.604332 2.305945 -0.112865
C  3.752745 0.783216 -1.063985
C  -1.134473 3.947542 0.509976
C  -3.363155 0.589136 -0.879395
C  -3.721721 -1.154135 0.799752
C  -1.29751 3.795048 2.016161
H  2.923631 -1.642378 -1.124658
H  1.281924 -2.202356 -1.147079
H  2.497219 -3.388546 0.56473
H  1.283888 -2.400617 1.33596
H  4.254019 -1.721345 1.117313
H  3.055297 -0.672537 1.844591
H  2.545261 -2.427485 3.561589
H  3.74139 -3.491953 2.833591
H  4.249067 -1.98748 3.593091
H  4.210537 1.766334 -1.13128
H  3.820216 0.30417 -2.042248
H  4.329464 0.173766 -0.368175
H  0.872658 4.282304 -0.097886
H  -1.303169 4.984913 0.217869
H  -1.891096 3.35596 -0.007394
H  -2.951569 0.775665 -1.866281
H  -2.931066 1.302026 -0.17456
H  -4.441267 0.738773 -0.928375
H  -3.596269 -2.215027 0.994478
H  -3.297982 -0.581937 1.62985
H  -4.790013 -0.94893 0.745353
H  -2.292751 4.115551 2.326911
H  -0.568196 4.39978 2.555601
H  -1.168886 2.756138 2.316428
totalener: -1352.83495024 hartree
nucrepener: 2084.41745450 hartree
electener: -3437.25240474 hartree
oneelecener: -5992.78271542 hartree
twoeener: 2555.53031068 hartree
kineticenergy: 1347.74158737 hartree
xcener: -110.800304702592 hartree
chargesum: 0.0000000
charge: 0.877334 -0.319259 -0.436170 -0.436949 -0.340649 -0.375445 -0.161731 -0.214043 -0.148821 -0.108772 -0.137023 -0.101034 0.158319 0.316928 -0.266944 0.421237 -0.295494 -0.030710 -0.215519 -0.186662 -0.236601 0.083652 0.105480 0.071989 0.076964 0.051566 0.068429 0.076733 0.074915 0.084443 0.105785 0.101185 0.104790 0.139648 0.089638 0.080345 0.135575 0.103694 0.106784 0.129453 0.107212 0.094960 0.076734 0.076760 0.091275
qa: 0.8773 -0.3193 -0.4362 -0.4369 -0.3406 -0.3754 -0.1617 -0.2140 -0.1488 -0.1088 -0.1370 -0.1010 0.1583 0.3169 -0.2669 0.4212 -0.2955 -0.0307 -0.2155 -0.1867 -0.2366 0.0837 0.1055 0.0720 0.0770 0.0516 0.0684 0.0767 0.0749 0.0844 0.1058 0.1012 0.1048 0.1396 0.0896 0.0803 0.1356 0.1037 0.1068 0.1295 0.1072 0.0950 0.0767 0.0768 0.0913
va: 6.0654 2.0222 2.0727 2.0465 3.0718 2.9929 3.0591 3.1409 3.8497 3.8252 3.6991 3.8600 3.8781 4.0981 3.9728 4.1137 3.9165 3.9202 3.9203 3.9102 3.8764 1.0084 1.0286 1.0141 1.0199 1.0028 1.0026 1.0033 1.0028 1.0043 1.0259 0.9967 0.9948 1.0440 0.9998 1.0037 1.0084 0.9939 0.9962 1.0119 0.9942 0.9942 1.0113 1.0120 1.0141
dispcorr: -0.023639711 hartree
energy: -1352.858589947034
dipole: 9.45773 -9.79887 -0.34115 4.68197 -3.28439 1.39759 15.67457 -14.89393 0.78064
magnitude: 1.63677 au
magnitude: 4.16034 debye
