program: Orca
programVersion: 4.2.1
elementType: O O O N C C C C C C C C C C C C C C C C C C C C H H H H H H H H H H H H H H H H H H H H H H H
charge: 0
multiplicity: 1
keywords: wb97x-d3
keywords: def2-TZVPP
keywords: def2/J RIJCOSX GRIDX6 NOFINALGRIDX
keywords: grid4 nofinalgrid
keywords: scfconv7
keywords: smallprint printgap noloewdin
keywords: NOSOSCF
formula: C20H23NO3
InChI: InChI=1/C20H23NO3/c1-14-9-8-10-15(2)19(14)21(16(3)20(23)24-4)18(22)13-17-11-6-5-7-12-17/h5-12,16H,13H2,1-4H3
47 atoms
O  3.454749 1.319812 -0.810119
O  0.349776 1.599016 -0.760638
O  2.518478 0.721359 1.12571
N  0.560315 -0.615596 -0.483789
C  1.962252 -0.496978 -0.886587
C  -0.055519 -1.900325 -0.391656
C  -0.472914 -2.523271 -1.574647
C  -0.218281 -2.509405 0.854176
C  -0.166234 0.527588 -0.470285
C  -1.631216 0.434414 -0.095979
C  2.742116 -1.788197 -0.66728
C  2.636255 0.593628 -0.068062
C  -1.061353 -3.779446 -1.489854
C  -0.811423 -3.769983 0.897459
C  -2.126336 1.727411 0.484445
C  -0.278497 -1.87097 -2.910679
C  0.174961 -1.836227 2.13419
C  -1.228451 -4.400693 -0.261249
C  -3.044441 2.521297 -0.190803
C  -1.65932 2.15029 1.727935
C  -3.488279 3.717657 0.361531
C  -2.09499 3.344383 2.279709
C  -3.012213 4.134242 1.59549
C  4.212836 2.335921 -0.150563
H  2.025177 -0.226383 -1.944318
H  -1.812174 -0.385099 0.60026
H  -2.191497 0.181894 -1.001948
H  2.360803 -2.596747 -1.288712
H  3.783512 -1.630606 -0.948198
H  2.716167 -2.109014 0.37354
H  -1.39164 -4.274719 -2.394397
H  -0.946384 -4.258345 1.854771
H  -0.603094 -0.830199 -2.923256
H  0.770128 -1.884401 -3.21559
H  -0.840604 -2.397353 -3.680261
H  0.579187 -2.559753 2.841801
H  0.912395 -1.050626 1.99262
H  -0.697089 -1.382727 2.61278
H  -1.686602 -5.37968 -0.209052
H  -3.42011 2.205087 -1.156445
H  -0.947217 1.538949 2.271561
H  -4.2048 4.324525 -0.176393
H  -1.719237 3.660462 3.244032
H  -3.352947 5.067406 2.024499
H  3.561588 3.077975 0.310186
H  4.808142 2.813236 -0.923332
H  4.875082 1.914787 0.605203
elementType: O N C H
totalener: -1056.53985240 hartree
nucrepener: 2123.02647849 hartree
electener: -3179.56633089 hartree
oneelecener: -5656.73323925 hartree
twoeener: 2477.16690836 hartree
cpcmener: -0.03997708 hartree
kineticenergy: 1051.88109553 hartree
xcener: -103.188035415242 hartree
chargesum: -0.0000000
charge: -0.286899 -0.520467 -0.468655 0.029717 0.058978 0.140021 -0.242147 -0.169472 0.284025 -0.065806 -0.277755 0.426476 -0.048817 -0.062936 0.066883 -0.257772 -0.297009 -0.191892 -0.189521 -0.238179 -0.169110 -0.165263 -0.163211 -0.123895 0.098816 0.144087 0.124198 0.113281 0.120892 0.113509 0.141390 0.139563 0.107937 0.103292 0.105747 0.117935 0.099954 0.111456 0.161489 0.138551 0.140132 0.160542 0.161850 0.162777 0.116323 0.131526 0.117459
qa: -0.2869 -0.5205 -0.4687 0.0297 0.0590 0.1400 -0.2421 -0.1695 0.2840 -0.0658 -0.2778 0.4265 -0.0488 -0.0629 0.0669 -0.2578 -0.2970 -0.1919 -0.1895 -0.2382 -0.1691 -0.1653 -0.1632 -0.1239 0.0988 0.1441 0.1242 0.1133 0.1209 0.1135 0.1414 0.1396 0.1079 0.1033 0.1057 0.1179 0.1000 0.1115 0.1615 0.1386 0.1401 0.1605 0.1618 0.1628 0.1163 0.1315 0.1175
va: 2.1339 1.9880 2.0258 2.9388 3.8321 3.3502 3.9287 3.8575 4.1314 3.7101 3.9466 4.1097 3.7879 3.8218 3.4962 3.9539 3.9125 3.9503 3.9655 3.9732 3.8976 3.9117 3.8831 3.8630 1.0333 0.9941 1.0093 0.9979 1.0091 0.9978 1.0005 0.9997 0.9968 0.9927 1.0046 1.0003 1.0308 0.9923 0.9891 1.0079 1.0049 0.9908 0.9909 0.9887 0.9939 0.9947 0.9930
dispcorr: -0.026749472 hartree
energy: -1056.566601874489
dipole: 2.77842 -2.77144 0.00697 -5.92717 3.97469 -1.95247 -1.01044 0.24209 -0.76835
magnitude: 2.09823 au
magnitude: 5.33327 debye
