program: Orca
programVersion: 4.2.1
elementType: O O O N C C C C C C C C C C C C C C C C C C C C H H H H H H H H H H H H H H H H H H H H H H H
charge: 0
multiplicity: 1
keywords: wb97x-d3
keywords: def2-TZVPP
keywords: def2/J RIJCOSX GRIDX6 NOFINALGRIDX
keywords: grid4 nofinalgrid
keywords: scfconv7
keywords: smallprint printgap noloewdin
keywords: NOSOSCF
formula: C20H23NO3
InChI: InChI=1/C20H23NO3/c1-14-9-8-10-15(2)19(14)21(16(3)20(23)24-4)18(22)13-17-11-6-5-7-12-17/h5-12,16H,13H2,1-4H3
47 atoms
O  3.903677 1.076126 -0.906962
O  1.351424 1.882766 0.703778
O  3.50796 -0.184705 0.892628
N  0.764188 -0.168893 0.022683
C  1.89324 -0.139815 -0.907044
C  -0.206061 -1.212339 -0.062813
C  -1.139779 -1.173794 -1.104621
C  -0.191868 -2.251732 0.871009
C  0.574512 0.936756 0.781529
C  -0.627277 0.990925 1.701992
C  2.160975 -1.496366 -1.549153
C  3.162389 0.263473 -0.172738
C  -2.076925 -2.196331 -1.190995
C  -1.153461 -3.253073 0.75567
C  -1.863751 1.422561 0.952883
C  -1.148833 -0.065482 -2.112251
C  0.796773 -2.299201 1.996258
C  -2.087533 -3.227901 -0.266056
C  -1.926869 2.684976 0.365656
C  -2.944326 0.559509 0.809105
C  -3.043827 3.069339 -0.361785
C  -4.061542 0.941153 0.079654
C  -4.112736 2.195158 -0.512081
C  5.186832 1.439192 -0.392389
H  1.701736 0.59107 -1.697352
H  -0.390523 1.713308 2.484058
H  -0.804579 0.033753 2.190237
H  3.035941 -1.420607 -2.194512
H  2.355019 -2.267862 -0.804938
H  1.331595 -1.820118 -2.174603
H  -2.811729 -2.176613 -1.986085
H  -1.160897 -4.064361 1.473159
H  -2.086376 -0.059553 -2.665452
H  -1.034305 0.916265 -1.653209
H  -0.345665 -0.177807 -2.844749
H  0.979664 -3.327787 2.304902
H  1.75129 -1.84744 1.736366
H  0.42089 -1.767646 2.874429
H  -2.825812 -4.015515 -0.342851
H  -1.097424 3.37361 0.474574
H  -2.908358 -0.425235 1.259329
H  -3.078527 4.052249 -0.813481
H  -4.890541 0.254076 -0.029856
H  -4.982184 2.492155 -1.083965
H  5.822025 0.565212 -0.251998
H  5.097978 1.979697 0.549381
H  5.633048 2.090549 -1.13776
elementType: O N C H
totalener: -1056.53924488 hartree
nucrepener: 2185.07673291 hartree
electener: -3241.61597779 hartree
oneelecener: -5780.30932974 hartree
twoeener: 2538.69335194 hartree
cpcmener: -0.03530308 hartree
kineticenergy: 1051.89540945 hartree
xcener: -103.196025196288 hartree
chargesum: -0.0000000
charge: -0.286229 -0.525499 -0.471982 0.038328 0.078335 0.196159 -0.251719 -0.237916 0.292464 -0.041701 -0.276532 0.415758 -0.025571 -0.038538 0.014841 -0.280235 -0.271583 -0.218118 -0.237313 -0.173711 -0.137724 -0.143832 -0.181972 -0.124910 0.097732 0.121760 0.126144 0.120126 0.113045 0.110604 0.134184 0.137952 0.103237 0.108390 0.115208 0.110047 0.100829 0.105651 0.159302 0.134132 0.142363 0.163199 0.156139 0.162691 0.117878 0.117234 0.131355
qa: -0.2862 -0.5255 -0.4720 0.0383 0.0783 0.1962 -0.2517 -0.2379 0.2925 -0.0417 -0.2765 0.4158 -0.0256 -0.0385 0.0148 -0.2802 -0.2716 -0.2181 -0.2373 -0.1737 -0.1377 -0.1438 -0.1820 -0.1249 0.0977 0.1218 0.1261 0.1201 0.1130 0.1106 0.1342 0.1380 0.1032 0.1084 0.1152 0.1100 0.1008 0.1057 0.1593 0.1341 0.1424 0.1632 0.1561 0.1627 0.1179 0.1172 0.1314
va: 2.1345 1.9771 2.0244 2.9291 3.8024 3.2634 3.8789 3.9004 4.1026 3.8046 3.9492 4.1308 3.7518 3.7737 3.5112 3.9541 3.9218 3.9757 3.9457 3.8865 3.8826 3.8724 3.9070 3.8624 1.0323 1.0208 1.0085 1.0094 0.9982 1.0007 1.0019 1.0005 1.0065 0.9974 0.9972 1.0022 1.0242 0.9941 0.9896 1.0267 0.9946 0.9886 0.9935 0.9881 0.9930 0.9935 0.9949
dispcorr: -0.030319274 hartree
energy: -1056.569564156332
dipole: 0.07971 -1.07877 -0.99906 -5.13176 3.82738 -1.30438 -4.26595 2.95920 -1.30675
magnitude: 2.09932 au
magnitude: 5.33604 debye
