program: Orca
programVersion: 4.2.1
elementType: O O O N C C C C C C C C C C C C C C C C C C C C H H H H H H H H H H H H H H H H H H H H H H H
charge: 0
multiplicity: 1
keywords: wb97x-d3
keywords: def2-TZVPP
keywords: def2/J RIJCOSX GRIDX6 NOFINALGRIDX
keywords: grid4 nofinalgrid
keywords: scfconv7
keywords: smallprint printgap noloewdin
keywords: NOSOSCF
formula: C20H23NO3
InChI: InChI=1/C20H23NO3/c1-14-9-8-10-15(2)19(14)21(16(3)20(23)24-4)18(22)13-17-11-6-5-7-12-17/h5-12,16H,13H2,1-4H3
47 atoms
O  3.876563 0.818644 -0.731697
O  1.757501 1.060855 1.548194
O  1.896435 1.64001 -1.335861
N  0.768717 -0.466445 0.23761
C  2.010157 -0.624892 -0.516046
C  -0.282436 -1.397384 -0.008491
C  -1.068041 -1.24021 -1.160263
C  -0.497627 -2.460547 0.875942
C  0.753796 0.425151 1.260364
C  -0.55811 0.656565 1.985226
C  2.992825 -1.573602 0.153405
C  2.565674 0.749686 -0.878084
C  -2.070679 -2.167591 -1.411234
C  -1.522321 -3.362455 0.590945
C  -1.585917 1.297663 1.088636
C  -0.867884 -0.094321 -2.10279
C  0.290823 -2.672249 2.136841
C  -2.299718 -3.223636 -0.543163
C  -1.337378 2.545322 0.519491
C  -2.786135 0.656923 0.803133
C  -2.271758 3.13825 -0.31673
C  -3.721961 1.24741 -0.034491
C  -3.467185 2.489261 -0.598013
C  4.511425 2.04212 -1.098463
H  1.731147 -1.067675 -1.47746
H  -0.335802 1.307648 2.831597
H  -0.951034 -0.271964 2.400072
H  3.856195 -1.75211 -0.486005
H  3.346465 -1.200885 1.113402
H  2.514926 -2.540302 0.312406
H  -2.689059 -2.051627 -2.293014
H  -1.702752 -4.186218 1.271609
H  -0.02461 -0.265172 -2.776631
H  -1.751056 0.041577 -2.725485
H  -0.676472 0.838587 -1.577881
H  1.14335 -2.007279 2.245896
H  -0.342815 -2.534335 3.015579
H  0.670457 -3.69378 2.183598
H  -3.088403 -3.935554 -0.751078
H  -0.406908 3.059905 0.73038
H  -2.990089 -0.31684 1.232479
H  -2.065283 4.108616 -0.750134
H  -4.649917 0.732769 -0.249312
H  -4.195378 2.949896 -1.25338
H  4.140236 2.877519 -0.504444
H  4.376228 2.263741 -2.157326
H  5.569649 1.902193 -0.894942
elementType: O N C H
totalener: -1056.54675335 hartree
nucrepener: 2203.74546692 hartree
electener: -3260.29222028 hartree
oneelecener: -5817.80648858 hartree
twoeener: 2557.51426831 hartree
cpcmener: -0.02853229 hartree
kineticenergy: 1051.88549191 hartree
xcener: -103.191690608698 hartree
chargesum: 0.0000000
charge: -0.274918 -0.485609 -0.442408 0.074392 0.145367 0.139031 -0.121724 -0.252399 0.249124 -0.079574 -0.333496 0.400760 -0.054331 -0.086741 0.067595 -0.279779 -0.324313 -0.192600 -0.230663 -0.187891 -0.130744 -0.137859 -0.179280 -0.129411 0.107321 0.115741 0.129838 0.109448 0.106230 0.108213 0.131839 0.135848 0.109359 0.100048 0.100561 0.110140 0.119521 0.123879 0.156685 0.126404 0.134478 0.158607 0.153048 0.157223 0.115153 0.113520 0.124364
qa: -0.2749 -0.4856 -0.4424 0.0744 0.1454 0.1390 -0.1217 -0.2524 0.2491 -0.0796 -0.3335 0.4008 -0.0543 -0.0867 0.0676 -0.2798 -0.3243 -0.1926 -0.2307 -0.1879 -0.1307 -0.1379 -0.1793 -0.1294 0.1073 0.1157 0.1298 0.1094 0.1062 0.1082 0.1318 0.1358 0.1094 0.1000 0.1006 0.1101 0.1195 0.1239 0.1567 0.1264 0.1345 0.1586 0.1530 0.1572 0.1152 0.1135 0.1244
va: 2.1382 2.0204 2.0586 2.9140 3.7306 3.4919 3.8368 3.8729 4.1355 3.8407 3.9670 4.1339 3.7749 3.8281 3.4987 3.9550 3.9421 3.9611 3.9351 3.9008 3.8603 3.8723 3.9103 3.8813 1.0035 1.0223 0.9999 1.0142 1.0103 0.9899 1.0035 0.9991 1.0039 1.0072 1.0064 0.9993 0.9934 0.9930 0.9900 1.0269 0.9989 0.9898 0.9935 0.9899 0.9937 0.9930 0.9957
dispcorr: -0.030755282 hartree
energy: -1056.577508634367
dipole: 1.63178 -2.02438 -0.39260 -5.41171 3.68680 -1.72491 -0.75894 0.37325 -0.38569
magnitude: 1.81058 au
magnitude: 4.60213 debye
