program: Orca
programVersion: 4.2.1
elementType: O O O N C C C C C C C C C C C C C C C C C C C C H H H H H H H H H H H H H H H H H H H H H H H
charge: 0
multiplicity: 1
keywords: wb97x-d3
keywords: def2-TZVPP
keywords: def2/J RIJCOSX GRIDX6 NOFINALGRIDX
keywords: grid4 nofinalgrid
keywords: scfconv7
keywords: smallprint printgap noloewdin
keywords: NOSOSCF
formula: C20H23NO3
InChI: InChI=1/C20H23NO3/c1-14-9-8-10-15(2)19(14)21(16(3)20(23)24-4)18(22)13-17-11-6-5-7-12-17/h5-12,16H,13H2,1-4H3
47 atoms
O  3.496056 1.291199 -0.715375
O  0.395483 1.621759 -0.807953
O  2.449833 0.714128 1.169931
N  0.553651 -0.595495 -0.533297
C  1.972014 -0.489388 -0.872546
C  -0.069614 -1.875286 -0.441335
C  -0.427655 -2.527396 -1.62718
C  -0.287976 -2.458066 0.809925
C  -0.154125 0.561693 -0.550977
C  -1.635168 0.499462 -0.244609
C  2.731609 -1.789213 -0.635487
C  2.623909 0.587014 -0.015397
C  -1.007549 -3.788209 -1.54191
C  -0.873693 -3.721236 0.8540
C  -2.108406 1.746942 0.446842
C  -0.183054 -1.892671 -2.963679
C  0.043207 -1.745403 2.085309
C  -1.227685 -4.382739 -0.309019
C  -3.101378 2.544858 -0.108055
C  -1.570912 2.107693 1.681806
C  -3.557305 3.677016 0.557256
C  -2.021011 3.236853 2.347099
C  -3.018932 4.025787 1.786608
C  4.25481 2.274635 -0.011787
H  2.082473 -0.206075 -1.923295
H  -1.886646 -0.37671 0.353348
H  -2.163157 0.370227 -1.194822
H  2.668976 -2.116477 0.402521
H  2.366504 -2.59274 -1.273358
H  3.783868 -1.640094 -0.87896
H  -1.288963 -4.3076 -2.449741
H  -1.049773 -4.189305 1.814981
H  -0.627306 -2.488146 -3.760952
H  -0.606413 -0.887549 -3.031165
H  0.884349 -1.807006 -3.185593
H  0.906938 -1.090652 1.992955
H  -0.796192 -1.124559 2.412489
H  0.237105 -2.456466 2.888269
H  -1.677873 -5.365802 -0.2561
H  -3.526688 2.27987 -1.068879
H  -0.788956 1.503935 2.130121
H  -4.333672 4.285749 0.111532
H  -1.591848 3.503732 3.304555
H  -3.372957 4.906397 2.307025
H  3.611258 3.052909 0.399565
H  4.925054 2.716438 -0.744015
H  4.843024 1.829674 0.79097
elementType: O N C H
totalener: -1056.54926192 hartree
nucrepener: 2126.08677438 hartree
electener: -3182.63603631 hartree
oneelecener: -5662.60054323 hartree
twoeener: 2479.96450693 hartree
cpcmener: -0.03234931 hartree
kineticenergy: 1051.87322970 hartree
xcener: -103.184908877285 hartree
chargesum: -0.0000000
charge: -0.282760 -0.489223 -0.447312 0.044679 0.050985 0.126687 -0.241277 -0.174538 0.277231 -0.096440 -0.275442 0.412153 -0.042315 -0.054331 0.096527 -0.252418 -0.292552 -0.192314 -0.180914 -0.244848 -0.162063 -0.165175 -0.164103 -0.125604 0.095338 0.142461 0.117179 0.112924 0.111693 0.118482 0.138469 0.136627 0.103157 0.107158 0.101582 0.109027 0.106166 0.110937 0.157851 0.134999 0.138994 0.156260 0.157751 0.158516 0.116936 0.129208 0.113653
qa: -0.2828 -0.4892 -0.4473 0.0447 0.0510 0.1267 -0.2413 -0.1745 0.2772 -0.0964 -0.2754 0.4122 -0.0423 -0.0543 0.0965 -0.2524 -0.2926 -0.1923 -0.1809 -0.2448 -0.1621 -0.1652 -0.1641 -0.1256 0.0953 0.1425 0.1172 0.1129 0.1117 0.1185 0.1385 0.1366 0.1032 0.1072 0.1016 0.1090 0.1062 0.1109 0.1579 0.1350 0.1390 0.1563 0.1578 0.1585 0.1169 0.1292 0.1137
va: 2.1366 2.0311 2.0488 2.9232 3.8490 3.3879 3.9299 3.8500 4.1378 3.7339 3.9420 4.1314 3.7891 3.8190 3.5124 3.9567 3.9261 3.9637 3.9565 3.9851 3.9033 3.9302 3.8966 3.8706 1.0336 0.9938 1.0150 0.9985 0.9979 1.0100 1.0013 1.0017 1.0052 0.9962 0.9937 1.0257 0.9903 1.0045 0.9904 1.0079 1.0059 0.9921 0.9923 0.9900 0.9932 0.9948 0.9939
dispcorr: -0.026947032 hartree
energy: -1056.576208957105
dipole: 2.78132 -2.73312 0.04819 -5.93335 4.12078 -1.81258 -0.87922 0.16572 -0.71349
magnitude: 1.94854 au
magnitude: 4.95281 debye
