program: Orca
programVersion: 4.2.1
elementType: O O O N C C C C C C C C C C C C C C C C C C C C H H H H H H H H H H H H H H H H H H H H H H H
charge: 0
multiplicity: 1
keywords: wb97x-d3
keywords: def2-TZVPP
keywords: def2/J RIJCOSX GRIDX6 NOFINALGRIDX
keywords: grid4 nofinalgrid
keywords: scfconv7
keywords: smallprint printgap noloewdin
keywords: NOSOSCF
formula: C20H23NO3
InChI: InChI=1/C20H23NO3/c1-14-9-8-10-15(2)19(14)21(16(3)20(23)24-4)18(22)13-17-11-6-5-7-12-17/h5-12,16H,13H2,1-4H3
47 atoms
O  3.25438 0.521173 -1.144913
O  1.445297 1.701918 0.734177
O  4.219266 0.199304 0.837252
N  0.856547 -0.306133 -0.07622
C  2.118375 -0.891702 0.374563
C  -0.153625 -1.180842 -0.577447
C  -0.113622 -1.553094 -1.930364
C  -1.148751 -1.662268 0.279271
C  0.648404 1.020533 0.105266
C  -0.575145 1.63972 -0.541842
C  2.114817 -1.335156 1.826792
C  3.29962 0.027391 0.079028
C  -1.084992 -2.421285 -2.410768
C  -2.104086 -2.533499 -0.244794
C  -1.78693 1.653578 0.355177
C  0.937221 -1.022578 -2.857474
C  -1.260498 -1.292984 1.729478
C  -2.074301 -2.91382 -1.571976
C  -1.748667 2.286079 1.595723
C  -2.967962 1.040921 -0.049808
C  -2.866938 2.296719 2.416237
C  -4.089422 1.053364 0.768202
C  -4.041209 1.678387 2.006277
C  4.291345 1.420272 -1.527167
H  2.279147 -1.779144 -0.247526
H  -0.820523 1.137932 -1.478028
H  -0.294801 2.664929 -0.792831
H  1.951952 -0.50258 2.509663
H  1.33742 -2.078865 1.991342
H  3.063312 -1.80589 2.081095
H  -1.069113 -2.711283 -3.454243
H  -2.88369 -2.911223 0.406252
H  1.924915 -1.429004 -2.633762
H  0.705477 -1.28992 -3.887647
H  1.024009 0.062595 -2.808857
H  -1.085881 -2.165468 2.362461
H  -0.566964 -0.519114 2.043275
H  -2.266779 -0.9359 1.951397
H  -2.825285 -3.590532 -1.959342
H  -0.840557 2.776582 1.925367
H  -3.011347 0.543416 -1.01135
H  -2.82208 2.792262 3.377774
H  -5.000409 0.570676 0.437679
H  -4.913935 1.688032 2.64666
H  4.048071 1.746376 -2.53487
H  5.266342 0.932341 -1.53498
H  4.328456 2.289676 -0.87011
elementType: O N C H
totalener: -1056.54696622 hartree
nucrepener: 2183.86579557 hartree
electener: -3240.41276179 hartree
oneelecener: -5777.25121031 hartree
twoeener: 2536.83844852 hartree
cpcmener: -0.02930924 hartree
kineticenergy: 1051.89032457 hartree
xcener: -103.191847593858 hartree
chargesum: 0.0000000
charge: -0.260970 -0.489327 -0.442789 0.071570 0.126367 0.145101 -0.198193 -0.179568 0.245304 -0.048554 -0.330665 0.397535 -0.052192 -0.085756 0.041366 -0.241738 -0.341924 -0.185558 -0.232348 -0.178978 -0.133143 -0.152721 -0.178681 -0.129165 0.109610 0.117724 0.124352 0.105463 0.112744 0.110266 0.137217 0.133940 0.094339 0.100178 0.094398 0.130210 0.097951 0.118253 0.157046 0.136385 0.131524 0.159088 0.154632 0.157387 0.118123 0.118034 0.116163
qa: -0.2610 -0.4893 -0.4428 0.0716 0.1264 0.1451 -0.1982 -0.1796 0.2453 -0.0486 -0.3307 0.3975 -0.0522 -0.0858 0.0414 -0.2417 -0.3419 -0.1856 -0.2323 -0.1790 -0.1331 -0.1527 -0.1787 -0.1292 0.1096 0.1177 0.1244 0.1055 0.1127 0.1103 0.1372 0.1339 0.0943 0.1002 0.0944 0.1302 0.0980 0.1183 0.1570 0.1364 0.1315 0.1591 0.1546 0.1574 0.1181 0.1180 0.1162
va: 2.1315 2.0105 2.0751 2.9079 3.7324 3.4974 3.9215 3.7871 4.1674 3.8286 3.9728 4.1801 3.7829 3.8123 3.4805 3.9571 3.9775 3.9521 3.9373 3.8816 3.8829 3.8870 3.9085 3.8746 1.0025 1.0090 1.0137 1.0097 0.9934 1.0151 1.0021 1.0004 1.0032 1.0059 1.0037 0.9935 0.9944 0.9942 0.9900 1.0267 1.0019 0.9900 0.9936 0.9908 0.9952 0.9933 0.9958
dispcorr: -0.030261592 hartree
energy: -1056.577227815489
dipole: -2.23495 0.65745 -1.57750 -4.04170 2.73366 -1.30804 -1.52635 -0.14549 -1.67183
magnitude: 2.64471 au
magnitude: 6.72233 debye
