program: Orca
programVersion: 4.2.1
elementType: O O O N C C C C C C C C C C C C C C C C C C C C H H H H H H H H H H H H H H H H H H H H H H H
charge: 0
multiplicity: 1
keywords: wb97x-d3
keywords: def2-TZVPP
keywords: def2/J RIJCOSX GRIDX6 NOFINALGRIDX
keywords: grid4 nofinalgrid
keywords: scfconv7
keywords: smallprint printgap noloewdin
keywords: NOSOSCF
formula: C20H23NO3
InChI: InChI=1/C20H23NO3/c1-14-9-8-10-15(2)19(14)21(16(3)20(23)24-4)18(22)13-17-11-6-5-7-12-17/h5-12,16H,13H2,1-4H3
47 atoms
O  3.459953 -0.00548 0.57331
O  1.333806 1.973133 0.421427
O  3.858182 1.183944 -1.271615
N  0.785515 -0.129272 -0.129088
C  1.835122 -0.098466 -1.14986
C  -0.14232 -1.212792 -0.084003
C  -1.158218 -1.273588 -1.043685
C  -0.009924 -2.192239 0.905744
C  0.600216 1.008383 0.587225
C  -0.551549 1.070567 1.570508
C  2.131526 -1.478683 -1.726587
C  3.1409 0.470247 -0.616326
C  -2.059326 -2.331969 -0.986698
C  -0.938776 -3.228461 0.93625
C  -1.827359 1.486991 0.880569
C  -1.288639 -0.237744 -2.118281
C  1.081522 -2.136553 1.93133
C  -1.955904 -3.299399 -0.001641
C  -1.920971 2.729201 0.255495
C  -2.921338 0.629648 0.836997
C  -3.081932 3.099574 -0.407273
C  -4.083432 0.998222 0.173699
C  -4.165842 2.232541 -0.454407
C  4.690127 0.433887 1.145316
H  1.534914 0.56455 -1.966551
H  -0.276545 1.806565 2.32766
H  -0.705309 0.122062 2.082744
H  2.949427 -1.399304 -2.442981
H  2.42361 -2.193914 -0.958321
H  1.276941 -1.884996 -2.264623
H  -2.856394 -2.389545 -1.717793
H  -0.857136 -3.992025 1.700249
H  -0.531911 -0.365186 -2.896683
H  -2.259435 -0.309696 -2.606366
H  -1.19124 0.77784 -1.734835
H  2.054121 -1.924792 1.492016
H  0.899327 -1.361498 2.680025
H  1.154376 -3.082922 2.465588
H  -2.668691 -4.113424 0.034365
H  -1.081647 3.413831 0.284409
H  -2.864873 -0.338484 1.32002
H  -3.13961 4.067862 -0.888107
H  -4.924391 0.316968 0.146077
H  -5.07102 2.520275 -0.97381
H  4.714311 1.518093 1.257142
H  5.54571 0.11199 0.551101
H  4.744317 -0.026659 2.128019
elementType: O N C H
totalener: -1056.54795904 hartree
nucrepener: 2191.77189277 hartree
electener: -3248.31985181 hartree
oneelecener: -5793.02938493 hartree
twoeener: 2544.70953312 hartree
cpcmener: -0.03038360 hartree
kineticenergy: 1051.88722764 hartree
xcener: -103.192412308522 hartree
chargesum: 0.0000000
charge: -0.263596 -0.492079 -0.448630 0.050825 0.063178 0.200305 -0.252449 -0.260492 0.274427 -0.050203 -0.276532 0.396619 -0.022967 -0.027552 0.010201 -0.279314 -0.250481 -0.215713 -0.232587 -0.173576 -0.134800 -0.142089 -0.177039 -0.125005 0.097706 0.122468 0.122442 0.119781 0.111874 0.108313 0.132794 0.135691 0.113479 0.100748 0.110290 0.104036 0.095240 0.102675 0.156566 0.133879 0.135699 0.159516 0.154091 0.159566 0.116849 0.117918 0.117927
qa: -0.2636 -0.4921 -0.4486 0.0508 0.0632 0.2003 -0.2524 -0.2605 0.2744 -0.0502 -0.2765 0.3966 -0.0230 -0.0276 0.0102 -0.2793 -0.2505 -0.2157 -0.2326 -0.1736 -0.1348 -0.1421 -0.1770 -0.1250 0.0977 0.1225 0.1224 0.1198 0.1119 0.1083 0.1328 0.1357 0.1135 0.1007 0.1103 0.1040 0.0952 0.1027 0.1566 0.1339 0.1357 0.1595 0.1541 0.1596 0.1168 0.1179 0.1179
va: 2.1197 2.0163 2.0700 2.9123 3.7979 3.2826 3.8728 3.9016 4.1188 3.8096 3.9443 4.1982 3.7571 3.7651 3.5127 3.9522 3.9436 3.9840 3.9530 3.8978 3.8907 3.8800 3.9117 3.8689 1.0304 1.0192 1.0082 1.0097 0.9970 1.0009 1.0021 1.0018 0.9968 1.0074 0.9964 1.0121 0.9970 1.0058 0.9907 1.0283 0.9968 0.9899 0.9935 0.9891 0.9955 0.9935 0.9949
dispcorr: -0.030576627 hartree
energy: -1056.578535668424
dipole: -0.70513 -0.59441 -1.29954 -7.63712 5.31327 -2.32385 -0.07978 0.71968 0.63990
magnitude: 2.73835 au
magnitude: 6.96032 debye
