program: Orca
programVersion: 5.0.2
elementType: Cl P O O O O O N C C C C C C C C C C H H H H H H H H H H H H H H H H H H H
charge: 0
multiplicity: 1
keywords: wb97x-d3
keywords: def2-TZVPP
keywords: def2/J RIJCOSX
keywords: DEFGRID2
keywords: scfconv7
keywords: smallprint printgap noloewdin
keywords: NOSOSCF
formula: C10H19ClNO5P
InChI: InChI=1/C10H19ClNO5P/c1-6-12(7-2)10(13)9(11)8(3)17-18(14,15-4)16-5/h6-7H2,1-5H3
37 atoms
Cl -0.346859 1.95448 -0.893226
P  2.22757 -0.198422 -0.22422
O  1.462313 0.55613 0.983466
O  -2.871677 1.482008 1.392121
O  2.954927 1.027986 -0.913321
O  3.457066 -0.911678 0.507818
O  1.381375 -1.080132 -1.042173
N  -2.855099 -0.208802 -0.11473
C  -4.289977 -0.403374 0.010336
C  -2.151638 -1.05554 -1.064874
C  -2.273211 0.767277 0.615547
C  -5.087253 0.502516 -0.915324
C  -1.804013 -2.424769 -0.5058
C  -0.79126 0.925379 0.415708
C  0.119932 0.363264 1.19958
C  -0.184439 -0.489313 2.382433
C  3.688748 0.83757 -2.11741
C  3.257511 -2.142782 1.187062
H  -4.502751 -1.451288 -0.210098
H  -4.584651 -0.233252 1.045092
H  -2.788287 -1.159589 -1.947414
H  -1.240872 -0.571998 -1.408426
H  -4.811591 0.34934 -1.959476
H  -6.154276 0.299232 -0.820612
H  -4.921219 1.549497 -0.66755
H  -1.105495 -2.336989 0.324686
H  -2.686827 -2.962057 -0.157102
H  -1.322678 -3.02921 -1.273565
H  0.18474 -1.507147 2.234985
H  0.306732 -0.08538 3.269181
H  -1.249696 -0.541594 2.590481
H  3.07653 0.366633 -2.88708
H  4.581226 0.233756 -1.946218
H  3.991972 1.824131 -2.458283
H  2.750564 -2.874708 0.557136
H  2.681666 -1.997905 2.103968
H  4.240467 -2.522853 1.454856
totalener: -1625.15455746 hartree
nucrepener: 1853.89098490 hartree
electener: -3479.04554236 hartree
oneelecener: -5920.42138730 hartree
twoeener: 2441.37584493 hartree
kineticenergy: 1620.17426583 hartree
xcener: -115.235714286026 hartree
chargesum: -0.0000000
charge: -0.068127 0.867589 -0.340992 -0.388414 -0.304287 -0.324884 -0.513088 -0.108079 -0.044732 -0.072564 0.236099 -0.239121 -0.231914 0.063886 0.159747 -0.280778 -0.135322 -0.139520 0.080409 0.091407 0.086253 0.105222 0.067446 0.083857 0.100421 0.073140 0.077138 0.094838 0.078710 0.119040 0.111976 0.119329 0.112145 0.118246 0.123189 0.102308 0.119428
qa: -0.0681 0.8676 -0.3410 -0.3884 -0.3043 -0.3249 -0.5131 -0.1081 -0.0447 -0.0726 0.2361 -0.2391 -0.2319 0.0639 0.1597 -0.2808 -0.1353 -0.1395 0.0804 0.0914 0.0863 0.1052 0.0674 0.0839 0.1004 0.0731 0.0771 0.0948 0.0787 0.1190 0.1120 0.1193 0.1121 0.1182 0.1232 0.1023 0.1194
va: 1.2601 5.6384 2.1244 2.1154 2.1375 2.1066 2.0554 3.1340 3.8978 3.9381 4.2087 3.9175 3.9143 3.9185 3.8164 3.9919 3.8727 3.8917 0.9963 1.0181 0.9965 1.0257 1.0074 1.0088 1.0099 1.0071 1.0089 1.0137 0.9941 1.0036 1.0158 0.9923 0.9910 0.9903 0.9908 0.9826 0.9936
dispcorr: -0.020224919 hartree
energy: -1625.174782377516
dipole: -13.68628 14.50869 0.82241 -19.26378 17.69098 -1.57280 0.07225 -0.42236 -0.35010
magnitude: 1.80904 au
magnitude: 4.59822 debye
