program: Orca
programVersion: 5.0.2
elementType: Cl P O O O O O N C C C C C C C C C C H H H H H H H H H H H H H H H H H H H
charge: 0
multiplicity: 1
keywords: wb97x-d3
keywords: def2-TZVPP
keywords: def2/J RIJCOSX
keywords: DEFGRID2
keywords: scfconv7
keywords: smallprint printgap noloewdin
keywords: NOSOSCF
formula: C10H19ClNO5P
InChI: InChI=1/C10H19ClNO5P/c1-6-12(7-2)10(13)9(11)8(3)17-18(14,15-4)16-5/h6-7H2,1-5H3
37 atoms
Cl -0.479546 1.498298 -1.141153
P  2.667688 -0.13284 0.171618
O  1.386222 -0.707184 -0.637154
O  -1.973756 0.626232 1.790769
O  3.647235 -0.066561 -1.072415
O  2.348549 1.401664 0.458285
O  3.068697 -0.910794 1.352999
N  -3.126651 -0.284394 0.069333
C  -4.378613 -0.223461 0.8071
C  -3.174103 -0.789526 -1.291313
C  -2.006185 0.173267 0.663896
C  -5.08724 1.113014 0.65454
C  -3.093264 -2.305476 -1.370563
C  -0.736959 0.11988 -0.136977
C  0.191842 -0.817709 0.02666
C  0.026504 -2.038362 0.86732
C  4.99199 0.358532 -0.886486
C  1.83822 1.837701 1.719023
H  -5.015171 -1.034312 0.447168
H  -4.179916 -0.422779 1.859174
H  -4.1056 -0.438479 -1.742102
H  -2.375362 -0.342847 -1.880725
H  -5.300298 1.338376 -0.391243
H  -6.036456 1.102229 1.190726
H  -4.480424 1.91997 1.061853
H  -2.131351 -2.664945 -1.006539
H  -3.877105 -2.783544 -0.782052
H  -3.204819 -2.638382 -2.402562
H  -0.977296 -2.123035 1.275678
H  0.23177 -2.92891 0.271186
H  0.735044 -2.033861 1.696043
H  5.503052 0.207876 -1.83395
H  5.494982 -0.224919 -0.114313
H  5.038139 1.416955 -0.625679
H  1.964162 2.917148 1.749018
H  2.384956 1.387567 2.547068
H  0.777654 1.603264 1.818284
totalener: -1625.15468543 hartree
nucrepener: 1831.17578304 hartree
electener: -3456.33046846 hartree
oneelecener: -5874.93354610 hartree
twoeener: 2418.60307764 hartree
kineticenergy: 1620.18076879 hartree
xcener: -115.236028640334 hartree
chargesum: -0.0000000
charge: -0.062699 0.880650 -0.324302 -0.398713 -0.315546 -0.329779 -0.519898 -0.100598 -0.044010 -0.074208 0.263102 -0.238169 -0.236854 -0.034575 0.138430 -0.239397 -0.139148 -0.116862 0.082007 0.093709 0.090224 0.103185 0.067085 0.086020 0.100979 0.084435 0.076319 0.091385 0.089422 0.104454 0.124476 0.116641 0.118271 0.113493 0.112868 0.119939 0.117667
qa: -0.0627 0.8806 -0.3243 -0.3987 -0.3155 -0.3298 -0.5199 -0.1006 -0.0440 -0.0742 0.2631 -0.2382 -0.2369 -0.0346 0.1384 -0.2394 -0.1391 -0.1169 0.0820 0.0937 0.0902 0.1032 0.0671 0.0860 0.1010 0.0844 0.0763 0.0914 0.0894 0.1045 0.1245 0.1166 0.1183 0.1135 0.1129 0.1199 0.1177
va: 1.2592 5.6425 2.1486 2.0963 2.1462 2.0764 2.0853 3.1551 3.8913 3.9370 4.1809 3.9209 3.9158 3.9105 3.8477 3.9704 3.8744 3.8419 0.9962 1.0176 0.9952 1.0090 1.0074 1.0087 1.0094 1.0007 1.0068 1.0121 1.0104 0.9985 1.0225 0.9912 0.9919 0.9893 0.9900 1.0015 0.9963
dispcorr: -0.019628303 hartree
energy: -1625.174313730221
dipole: -20.00228 19.27226 -0.73002 -7.99961 7.83822 -0.16138 3.72659 -4.55488 -0.82829
magnitude: 1.11582 au
magnitude: 2.83618 debye
