program: Orca
programVersion: 5.0.2
elementType: Cl P O O O O O N C C C C C C C C C C H H H H H H H H H H H H H H H H H H H
charge: 0
multiplicity: 1
keywords: wb97x-d3
keywords: def2-TZVPP
keywords: def2/J RIJCOSX
keywords: DEFGRID2
keywords: scfconv7
keywords: smallprint printgap noloewdin
keywords: NOSOSCF
formula: C10H19ClNO5P
InChI: InChI=1/C10H19ClNO5P/c1-6-12(7-2)10(13)9(11)8(3)17-18(14,15-4)16-5/h6-7H2,1-5H3
37 atoms
Cl -0.306647 -2.123831 -0.338778
P  2.820725 0.197348 -0.273188
O  1.365107 0.136497 -0.97323
O  -1.861414 0.178652 1.881929
O  3.2128 1.720923 -0.529434
O  2.524623 0.217547 1.29383
O  3.7404 -0.824896 -0.776222
N  -3.101566 -0.421243 0.089419
C  -4.335411 -0.174551 0.818647
C  -3.221079 -0.736417 -1.322327
C  -1.932675 -0.201168 0.729677
C  -4.754831 1.287942 0.790816
C  -3.696977 -2.155933 -1.590332
C  -0.668812 -0.4612 -0.036611
C  0.206255 0.493348 -0.34446
C  -0.004797 1.950036 -0.110945
C  4.559945 2.138331 -0.329197
C  2.22227 -0.970378 2.026824
H  -5.114509 -0.797188 0.375914
H  -4.212084 -0.509435 1.847359
H  -3.914222 -0.020529 -1.774996
H  -2.26169 -0.569723 -1.809869
H  -5.705921 1.418747 1.307353
H  -4.015871 1.913407 1.289008
H  -4.882934 1.650763 -0.230116
H  -3.764208 -2.328902 -2.664435
H  -3.005331 -2.884548 -1.172193
H  -4.684802 -2.343985 -1.168768
H  0.233644 2.509712 -1.015422
H  -1.02814 2.174391 0.17637
H  0.646125 2.312629 0.685557
H  4.640869 3.147203 -0.725993
H  5.26044 1.489358 -0.854932
H  4.813723 2.154978 0.731967
H  1.150084 -1.017321 2.21406
H  2.749689 -0.91218 2.976614
H  2.541868 -1.870509 1.501552
totalener: -1625.15408216 hartree
nucrepener: 1820.63991149 hartree
electener: -3445.79399365 hartree
oneelecener: -5853.69892532 hartree
twoeener: 2407.90493167 hartree
kineticenergy: 1620.16919355 hartree
xcener: -115.234651559357 hartree
chargesum: 0.0000000
charge: -0.068814 0.844936 -0.321822 -0.395644 -0.318296 -0.319819 -0.500671 -0.100653 -0.041499 -0.093380 0.256836 -0.247654 -0.213510 -0.032306 0.139965 -0.210236 -0.131184 -0.110681 0.084089 0.096061 0.087030 0.110373 0.088850 0.097478 0.067918 0.084216 0.082629 0.073873 0.105839 0.090858 0.103638 0.113222 0.122292 0.110814 0.110958 0.115414 0.118881
qa: -0.0688 0.8449 -0.3218 -0.3956 -0.3183 -0.3198 -0.5007 -0.1007 -0.0415 -0.0934 0.2568 -0.2477 -0.2135 -0.0323 0.1400 -0.2102 -0.1312 -0.1107 0.0841 0.0961 0.0870 0.1104 0.0888 0.0975 0.0679 0.0842 0.0826 0.0739 0.1058 0.0909 0.1036 0.1132 0.1223 0.1108 0.1110 0.1154 0.1189
va: 1.2569 5.6441 2.1347 2.0997 2.1032 2.0627 2.1364 3.1514 3.8875 3.9487 4.1950 3.9165 3.8923 3.8769 3.8712 3.9738 3.8717 3.8576 0.9986 1.0169 0.9947 0.9938 1.0101 1.0105 1.0058 1.0112 1.0231 1.0076 1.0060 1.0142 1.0121 0.9906 0.9955 0.9887 0.9923 0.9958 0.9992
dispcorr: -0.019555921 hartree
energy: -1625.173638076569
dipole: -22.13251 21.04479 -1.08772 9.57398 -8.70316 0.87082 2.06587 -2.18825 -0.12237
magnitude: 1.39873 au
magnitude: 3.55528 debye
