program: Orca
programVersion: 5.0.2
elementType: Cl P O O O O O N C C C C C C C C C C H H H H H H H H H H H H H H H H H H H
charge: 0
multiplicity: 1
keywords: wb97x-d3
keywords: def2-TZVPP
keywords: def2/J RIJCOSX
keywords: DEFGRID2
keywords: scfconv7
keywords: smallprint printgap noloewdin
keywords: NOSOSCF
formula: C10H19ClNO5P
InChI: InChI=1/C10H19ClNO5P/c1-6-12(7-2)10(13)9(11)8(3)17-18(14,15-4)16-5/h6-7H2,1-5H3
37 atoms
Cl -2.510552 -1.955168 -1.23425
P  2.22545 -0.207741 -0.148807
O  0.728622 -0.473674 0.39696
O  -1.128953 1.163482 -1.62422
O  2.486199 1.286657 0.304559
O  3.053161 -1.056856 0.900343
O  2.418942 -0.505762 -1.58249
N  -2.23846 1.059356 0.348419
C  -2.477707 2.498809 0.368111
C  -2.701672 0.313417 1.513266
C  -1.540525 0.526811 -0.6568
C  -1.345717 3.264558 1.030782
C  -4.19255 0.029681 1.487752
C  -1.265511 -0.948425 -0.595898
C  -0.110004 -1.429389 -0.151569
C  0.341899 -2.839541 -0.083302
C  2.324563 2.375847 -0.619815
C  4.489431 -1.060783 0.880777
H  -2.641346 2.853422 -0.647952
H  -3.409176 2.670272 0.907321
H  -2.14425 -0.616783 1.598355
H  -2.448151 0.897414 2.400171
H  -1.576889 4.329771 1.044392
H  -1.200482 2.94342 2.062955
H  -0.403528 3.132469 0.498427
H  -4.465464 -0.59846 0.640327
H  -4.479426 -0.493165 2.400128
H  -4.780231 0.946523 1.435293
H  1.18826 -3.016221 -0.749712
H  0.660019 -3.084492 0.930615
H  -0.449587 -3.527525 -0.366922
H  2.493538 3.286761 -0.052939
H  1.320673 2.396173 -1.04039
H  3.056887 2.311946 -1.422959
H  4.868671 -1.422632 -0.073964
H  4.807599 -1.734724 1.670972
H  4.884842 -0.065306 1.079934
elementType: Cl P O N C H
totalener: -1625.17235588 hartree
nucrepener: 1840.79043892 hartree
electener: -3465.96279480 hartree
oneelecener: -5895.49632625 hartree
twoeener: 2429.53353145 hartree
cpcmener: -0.04592776 hartree
kineticenergy: 1620.10825430 hartree
xcener: -115.231787447910 hartree
chargesum: -0.0000000
charge: -0.074827 0.962166 -0.344162 -0.555739 -0.359496 -0.346422 -0.632692 -0.086986 -0.030520 -0.055557 0.334645 -0.251514 -0.237139 -0.005078 0.122471 -0.205666 -0.126498 -0.117948 0.088653 0.100888 0.110255 0.104319 0.099611 0.086865 0.078825 0.072042 0.095601 0.087901 0.112191 0.118631 0.091154 0.132315 0.120397 0.136171 0.120684 0.130068 0.124393
qa: -0.0748 0.9622 -0.3442 -0.5557 -0.3595 -0.3464 -0.6327 -0.0870 -0.0305 -0.0556 0.3346 -0.2515 -0.2371 -0.0051 0.1225 -0.2057 -0.1265 -0.1179 0.0887 0.1009 0.1103 0.1043 0.0996 0.0869 0.0788 0.0720 0.0956 0.0879 0.1122 0.1186 0.0912 0.1323 0.1204 0.1362 0.1207 0.1301 0.1244
va: 1.2480 5.5681 2.1064 1.9302 2.0866 2.1147 1.9409 3.1970 3.8615 3.9048 4.1515 3.9309 3.9104 3.9566 3.8179 3.9347 3.8163 3.8402 1.0182 0.9997 0.9951 0.9938 1.0077 1.0051 1.0014 1.0163 1.0076 1.0053 1.0100 1.0037 1.0235 0.9900 0.9889 0.9970 0.9917 0.9885 0.9909
dispcorr: -0.019828817 hartree
energy: -1625.192184698082
dipole: -2.26228 2.38804 0.12576 13.87054 -13.59340 0.27714 14.29486 -11.12893 3.16594
magnitude: 3.18053 au
magnitude: 8.08427 debye
