program: Orca
programVersion: 5.0.2
elementType: Cl P O O O O O N C C C C C C C C C C H H H H H H H H H H H H H H H H H H H
charge: 0
multiplicity: 1
keywords: wb97x-d3
keywords: def2-TZVPP
keywords: def2/J RIJCOSX
keywords: DEFGRID2
keywords: scfconv7
keywords: smallprint printgap noloewdin
keywords: NOSOSCF
formula: C10H19ClNO5P
InChI: InChI=1/C10H19ClNO5P/c1-6-12(7-2)10(13)9(11)8(3)17-18(14,15-4)16-5/h6-7H2,1-5H3
37 atoms
Cl -2.613896 -2.056967 0.471649
P  2.054538 -0.419994 -0.63678
O  1.217235 -1.160836 0.523774
O  -0.616267 0.350045 2.25749
O  1.003089 0.677847 -1.092518
O  3.200011 0.285623 0.191801
O  2.603363 -1.278305 -1.704042
N  -1.82472 1.082365 0.491601
C  -1.875314 2.437166 1.033139
C  -2.272618 0.930552 -0.888354
C  -1.151999 0.147473 1.170627
C  -0.630852 3.251669 0.723369
C  -3.781499 0.971082 -1.047543
C  -1.093516 -1.237253 0.58932
C  0.046165 -1.865092 0.303236
C  0.237553 -3.258851 -0.16581
C  1.292988 1.56905 -2.180804
C  2.940832 1.312371 1.164549
H  -2.750941 2.925596 0.606745
H  -2.046124 2.388943 2.107628
H  -1.823325 1.736676 -1.47343
H  -1.875354 0.007218 -1.304712
H  -0.467038 3.340988 -0.351287
H  -0.747888 4.259755 1.121946
H  0.262669 2.819126 1.172259
H  -4.268121 0.165317 -0.500164
H  -4.203726 1.916917 -0.707396
H  -4.034939 0.86338 -2.102211
H  -0.698002 -3.805844 -0.229065
H  0.706633 -3.272478 -1.150956
H  0.89999 -3.791396 0.518944
H  1.713998 1.033759 -3.03118
H  1.983578 2.348348 -1.860615
H  0.350542 2.021054 -2.476219
H  2.744271 2.262445 0.669199
H  3.841344 1.401328 1.76651
H  2.106905 1.055328 1.81653
elementType: Cl P O N C H
totalener: -1625.17249154 hartree
nucrepener: 1893.05979279 hartree
electener: -3518.23228432 hartree
oneelecener: -5998.88141027 hartree
twoeener: 2480.64912595 hartree
cpcmener: -0.04646086 hartree
kineticenergy: 1620.08312253 hartree
xcener: -115.231268334947 hartree
chargesum: -0.0000000
charge: -0.079838 0.901868 -0.343917 -0.546684 -0.296684 -0.341177 -0.638433 -0.086646 -0.021780 -0.070076 0.336442 -0.272247 -0.244551 -0.069937 0.208799 -0.204918 -0.123419 -0.109409 0.101891 0.089866 0.103676 0.112486 0.084259 0.109132 0.079463 0.076236 0.088227 0.095905 0.087916 0.105916 0.115033 0.130488 0.132809 0.115481 0.117840 0.135022 0.120958
qa: -0.0798 0.9019 -0.3439 -0.5467 -0.2967 -0.3412 -0.6384 -0.0866 -0.0218 -0.0701 0.3364 -0.2722 -0.2446 -0.0699 0.2088 -0.2049 -0.1234 -0.1094 0.1019 0.0899 0.1037 0.1125 0.0843 0.1091 0.0795 0.0762 0.0882 0.0959 0.0879 0.1059 0.1150 0.1305 0.1328 0.1155 0.1178 0.1350 0.1210
va: 1.2408 5.5946 2.1145 1.9424 2.0614 2.0974 1.9809 3.1455 3.8566 3.8975 4.1420 3.9211 3.9347 3.9114 3.8000 3.9591 3.8381 3.8362 1.0002 1.0146 0.9938 0.9963 1.0008 1.0113 1.0120 1.0161 1.0042 1.0056 1.0227 1.0143 1.0003 1.0023 0.9811 0.9870 0.9842 0.9937 0.9940
dispcorr: -0.022545253 hartree
energy: -1625.195036789975
dipole: -4.97519 3.63659 -1.33860 22.51631 -20.00827 2.50804 -5.63832 4.30071 -1.33762
magnitude: 3.14187 au
magnitude: 7.98600 debye
