program: Orca
programVersion: 5.0.2
elementType: Cl P O O O O O N C C C C C C C C C C H H H H H H H H H H H H H H H H H H H
charge: 0
multiplicity: 1
keywords: wb97x-d3
keywords: def2-TZVPP
keywords: def2/J RIJCOSX
keywords: DEFGRID2
keywords: scfconv7
keywords: smallprint printgap noloewdin
keywords: NOSOSCF
formula: C10H19ClNO5P
InChI: InChI=1/C10H19ClNO5P/c1-6-12(7-2)10(13)9(11)8(3)17-18(14,15-4)16-5/h6-7H2,1-5H3
37 atoms
Cl -2.39285 -1.957339 0.467232
P  2.082393 -0.00122 -0.725891
O  1.342052 -0.728421 0.518681
O  -0.775004 0.789142 2.02691
O  2.970008 1.059627 0.041499
O  3.140617 -1.019713 -1.304944
O  1.151194 0.482123 -1.76219
N  -1.745297 1.239757 0.03639
C  -2.023533 2.616798 0.436936
C  -2.136705 0.848113 -1.311001
C  -1.148838 0.427888 0.913852
C  -3.210269 2.76358 1.373997
C  -3.639422 0.790458 -1.515706
C  -0.947965 -1.008908 0.520437
C  0.25161 -1.561395 0.357908
C  0.585056 -2.978768 0.077909
C  2.365943 2.185333 0.699881
C  4.161124 -1.640998 -0.508942
H  -1.127153 3.043948 0.889994
H  -2.203461 3.182212 -0.477062
H  -1.700649 1.569226 -2.005243
H  -1.686085 -0.11116 -1.554398
H  -3.36344 3.818912 1.60158
H  -4.126573 2.383892 0.922718
H  -3.053177 2.242473 2.317297
H  -3.850612 0.452849 -2.53055
H  -4.115328 0.095159 -0.825408
H  -4.10644 1.767917 -1.393307
H  1.112588 -3.069738 -0.873644
H  1.245352 -3.36629 0.855805
H  -0.297864 -3.60937 0.034819
H  1.808734 1.868429 1.580105
H  1.707783 2.730819 0.023998
H  3.178449 2.836878 1.008841
H  3.74544 -2.109029 0.382756
H  4.92138 -0.915946 -0.222774
H  4.614402 -2.407194 -1.131364
elementType: Cl P O N C H
totalener: -1625.17305610 hartree
nucrepener: 1863.57885231 hartree
electener: -3488.75190840 hartree
oneelecener: -5940.96092107 hartree
twoeener: 2452.20901267 hartree
cpcmener: -0.04181968 hartree
kineticenergy: 1620.09782335 hartree
xcener: -115.232107850998 hartree
chargesum: -0.0000000
charge: -0.077943 0.938232 -0.346393 -0.548602 -0.338069 -0.354598 -0.629272 -0.058444 -0.042286 -0.072321 0.327350 -0.255889 -0.254921 -0.083561 0.209727 -0.222816 -0.112738 -0.112592 0.091206 0.100632 0.103017 0.105154 0.100034 0.088599 0.085395 0.101750 0.077924 0.094167 0.115064 0.117154 0.094280 0.122158 0.119112 0.137248 0.122780 0.128930 0.130533
qa: -0.0779 0.9382 -0.3464 -0.5486 -0.3381 -0.3546 -0.6293 -0.0584 -0.0423 -0.0723 0.3274 -0.2559 -0.2549 -0.0836 0.2097 -0.2228 -0.1127 -0.1126 0.0912 0.1006 0.1030 0.1052 0.1000 0.0886 0.0854 0.1018 0.0779 0.0942 0.1151 0.1172 0.0943 0.1222 0.1191 0.1372 0.1228 0.1289 0.1305
va: 1.2456 5.5712 2.0801 1.9349 2.1033 2.1148 1.9671 3.1425 3.8595 3.8827 4.1260 3.9046 3.9193 3.9210 3.7884 3.9637 3.8207 3.8251 1.0125 0.9996 1.0008 1.0034 1.0053 1.0014 1.0135 1.0076 1.0152 0.9981 1.0036 0.9989 1.0241 1.0002 0.9930 0.9891 0.9878 0.9941 0.9890
dispcorr: -0.021103899 hartree
energy: -1625.194159995178
dipole: -5.60473 6.35342 0.74869 12.55730 -12.85939 -0.30209 -1.19346 0.79221 -0.40125
magnitude: 0.90155 au
magnitude: 2.29157 debye
