program: Orca
programVersion: 5.0.2
elementType: Cl P O O O O O N C C C C C C C C C C H H H H H H H H H H H H H H H H H H H
charge: 0
multiplicity: 1
keywords: wb97x-d3
keywords: def2-TZVPP
keywords: def2/J RIJCOSX
keywords: DEFGRID2
keywords: scfconv7
keywords: smallprint printgap noloewdin
keywords: NOSOSCF
formula: C10H19ClNO5P
InChI: InChI=1/C10H19ClNO5P/c1-6-12(7-2)10(13)9(11)8(3)17-18(14,15-4)16-5/h6-7H2,1-5H3
37 atoms
Cl -2.263671 -2.368931 0.534395
P  2.308579 -0.19637 -0.831879
O  0.694103 -0.207227 -0.854456
O  -0.681816 0.376996 1.928046
O  2.614279 1.352915 -0.786827
O  2.584976 -0.810615 0.606668
O  2.980186 -0.853952 -1.969157
N  -2.276304 0.985321 0.441171
C  -2.528724 2.243226 1.136807
C  -2.995868 0.780026 -0.810705
C  -1.340473 0.158429 0.914089
C  -1.576441 3.350363 0.721155
C  -4.454527 0.406104 -0.619447
C  -1.11874 -1.128592 0.173928
C  -0.075982 -1.333038 -0.624873
C  0.290079 -2.577143 -1.346545
C  2.351976 2.163353 0.371446
C  3.901654 -1.285117 0.936985
H  -3.554987 2.537312 0.918656
H  -2.481114 2.077084 2.212144
H  -2.921875 1.704081 -1.387955
H  -2.487856 0.018611 -1.398995
H  -1.845972 4.27752 1.227429
H  -0.544343 3.116595 0.980567
H  -1.62517 3.532236 -0.353077
H  -4.928622 0.291057 -1.594074
H  -4.559819 -0.535197 -0.081282
H  -5.006774 1.172906 -0.075682
H  1.207567 -3.014919 -0.948214
H  -0.491223 -3.326896 -1.261045
H  0.448283 -2.371511 -2.405413
H  3.17944 2.085489 1.074675
H  1.425143 1.884575 0.870144
H  2.270435 3.188998 0.022927
H  4.651081 -0.505524 0.802958
H  4.162976 -2.152126 0.332472
H  3.872715 -1.572576 1.983852
elementType: Cl P O N C H
totalener: -1625.17237931 hartree
nucrepener: 1841.88858487 hartree
electener: -3467.06096418 hartree
oneelecener: -5897.08754853 hartree
twoeener: 2430.02658435 hartree
cpcmener: -0.04582253 hartree
kineticenergy: 1620.09283319 hartree
xcener: -115.231330963727 hartree
chargesum: -0.0000000
charge: -0.078698 0.915201 -0.331630 -0.557011 -0.348326 -0.328740 -0.631927 -0.084840 -0.030847 -0.061048 0.337485 -0.253791 -0.235616 -0.019037 0.136868 -0.217925 -0.107670 -0.113228 0.101084 0.088753 0.103773 0.112621 0.100161 0.078534 0.086916 0.095439 0.072477 0.088222 0.116379 0.093506 0.118294 0.130358 0.109087 0.131766 0.129879 0.123345 0.130189
qa: -0.0787 0.9152 -0.3316 -0.5570 -0.3483 -0.3287 -0.6319 -0.0848 -0.0308 -0.0610 0.3375 -0.2538 -0.2356 -0.0190 0.1369 -0.2179 -0.1077 -0.1132 0.1011 0.0888 0.1038 0.1126 0.1002 0.0785 0.0869 0.0954 0.0725 0.0882 0.1164 0.0935 0.1183 0.1304 0.1091 0.1318 0.1299 0.1233 0.1302
va: 1.2435 5.5934 2.1066 1.9248 2.1041 2.0459 1.9738 3.2026 3.8651 3.9116 4.1413 3.9188 3.9051 3.9366 3.8190 3.9287 3.8365 3.8278 0.9996 1.0151 0.9941 0.9931 1.0075 1.0092 1.0039 1.0077 1.0164 1.0051 1.0007 1.0241 1.0067 0.9885 0.9870 0.9903 0.9854 0.9963 0.9903
dispcorr: -0.020060634 hartree
energy: -1625.192439944392
dipole: -7.07728 5.95796 -1.11932 16.70701 -15.64708 1.05994 1.22504 -1.07353 0.15151
magnitude: 1.54896 au
magnitude: 3.93715 debye
