program: Orca
programVersion: 5.0.2
elementType: Cl P O O O O O N C C C C C C C C C C H H H H H H H H H H H H H H H H H H H
charge: 0
multiplicity: 1
keywords: wb97x-d3
keywords: def2-TZVPP
keywords: def2/J RIJCOSX
keywords: DEFGRID2
keywords: scfconv7
keywords: smallprint printgap noloewdin
keywords: NOSOSCF
formula: C10H19ClNO5P
InChI: InChI=1/C10H19ClNO5P/c1-6-12(7-2)10(13)9(11)8(3)17-18(14,15-4)16-5/h6-7H2,1-5H3
37 atoms
Cl -2.453769 -1.901825 0.989459
P  2.291495 -0.211041 0.315365
O  0.902518 -0.473801 -0.466816
O  -0.823819 1.21085 1.412341
O  3.278019 -1.079661 -0.571657
O  2.666678 1.265753 -0.103739
O  2.235145 -0.507659 1.761397
N  -2.296289 1.128568 -0.30634
C  -2.580599 2.557169 -0.213252
C  -2.886953 0.427405 -1.440986
C  -1.41581 0.582948 0.537641
C  -1.604117 3.410814 -1.001854
C  -4.373209 0.160309 -1.291269
C  -1.171649 -0.8943 0.421512
C  -0.014891 -1.399531 0.004348
C  0.391675 -2.823154 -0.079506
C  4.683328 -1.093115 -0.269884
C  2.328266 2.415699 0.68856
H  -3.591895 2.714037 -0.587498
H  -2.593074 2.854302 0.834133
H  -2.710472 1.035439 -2.331179
H  -2.350634 -0.504457 -1.610314
H  -0.588873 3.324711 -0.61593
H  -1.593018 3.133592 -2.056617
H  -1.897269 4.458974 -0.93817
H  -4.586268 -0.466214 -0.426611
H  -4.947338 1.081901 -1.194111
H  -4.736274 -0.356968 -2.179411
H  0.799264 -3.041193 -1.067016
H  1.165017 -3.05168 0.657447
H  -0.442954 -3.494429 0.101602
H  5.125357 -0.110297 -0.431321
H  5.141362 -1.806316 -0.948828
H  4.863001 -1.410524 0.757009
H  1.420042 2.872315 0.300847
H  3.152454 3.118305 0.597616
H  2.192459 2.163396 1.738775
elementType: Cl P O N C H
totalener: -1625.17176440 hartree
nucrepener: 1837.21835268 hartree
electener: -3462.39011708 hartree
oneelecener: -5888.76933120 hartree
twoeener: 2426.37921412 hartree
cpcmener: -0.04619882 hartree
kineticenergy: 1620.10180770 hartree
xcener: -115.231704259638 hartree
chargesum: -0.0000000
charge: -0.076860 0.966096 -0.352732 -0.552851 -0.351196 -0.350539 -0.632891 -0.090898 -0.034614 -0.067294 0.346315 -0.253301 -0.234493 -0.035564 0.151909 -0.203591 -0.118317 -0.108242 0.102199 0.088774 0.104691 0.113253 0.083975 0.086464 0.098477 0.073610 0.088183 0.095728 0.118025 0.111995 0.091922 0.123984 0.129698 0.119296 0.118399 0.133437 0.116954
qa: -0.0769 0.9661 -0.3527 -0.5529 -0.3512 -0.3505 -0.6329 -0.0909 -0.0346 -0.0673 0.3463 -0.2533 -0.2345 -0.0356 0.1519 -0.2036 -0.1183 -0.1082 0.1022 0.0888 0.1047 0.1133 0.0840 0.0865 0.0985 0.0736 0.0882 0.0957 0.1180 0.1120 0.0919 0.1240 0.1297 0.1193 0.1184 0.1334 0.1170
va: 1.2448 5.5775 2.1054 1.9385 2.1152 2.1112 1.9405 3.2095 3.8663 3.9132 4.1434 3.9287 3.9009 3.9675 3.8188 3.9361 3.8428 3.8341 0.9996 1.0162 0.9951 0.9931 0.9915 1.0056 1.0070 1.0170 1.0047 1.0072 1.0044 1.0081 1.0229 0.9908 0.9888 0.9920 0.9721 0.9918 1.0025
dispcorr: -0.019393123 hartree
energy: -1625.191157521095
dipole: -4.33274 4.15005 -0.18269 14.42805 -14.05152 0.37653 -12.06356 9.30179 -2.76176
magnitude: 2.79329 au
magnitude: 7.09999 debye
