program: Gaussian 09
title: 000058866
version: EM64L-G09RevD.01
frameworkgroup: C1[X(C19H23NO3)]
method: RPBEPBE
basis: SDD
operation: Freq
keyword: #p
keyword: freq=noraman
keyword: PBEPBE/SDD
title: #p freq=noraman PBEPBE/SDD
converged: YES YES NO NO
title: Mulliken charges:
elementType: O O O N C C C C C C C C C C C C C C C C C C C H H H H H H H H H H H H H H H H H H H H H H H
charge: -0.480280 -0.252067 -0.258694 -0.097700 0.041105 -0.601732 0.380477 0.463415 0.185000 -0.359934 -0.397788 -0.259950 -0.344499 -0.380186 -0.419556 -0.248887 -0.220252 -0.242155 -0.233315 -0.242467 -0.253029 -0.621193 -0.607814 0.237970 0.238640 0.248818 0.287218 0.230894 0.243058 0.374450 0.226096 0.182410 0.259579 0.286462 0.222075 0.225506 0.227080 0.221894 0.215412 0.223318 0.233905 0.224385 0.195132 0.228940 0.191504 0.226757
chargesum: 0.00000
title: Mulliken charges with hydrogens summed into heavy atoms:
elementType: O O O N C C C C C C C C C C C C C C C C C C C
charge: -0.105830 -0.252067 -0.258694 -0.097700 0.041105 -0.125122 0.380477 0.463415 0.185000 -0.111116 -0.110571 0.214003 0.064007 -0.120607 -0.133095 -0.026812 0.005254 -0.015075 -0.011421 -0.027055 -0.029711 0.032230 0.039387
polarizability: 2.72540927e+02 9.52131069e+00 2.28558158e+02 7.08849823e+00 2.32307488e+01 1.46916668e+02
1716.lowfreq: -6.8089 -3.3881 -0.0008 -0.0007 -0.0004 5.0041 24.9642 32.9963 33.3208
frequency: 24.5635 32.9725 33.2087 44.2549 53.2052 54.5156 67.7917 68.1239 75.3187 124.8224 127.8484 186.2862 194.7443 213.6590 228.4392 240.9038 242.5910 260.0383 283.8581 297.6254 328.0636 344.2128 367.9550 378.4038 398.9894 406.3056 416.0844 419.8310 457.4474 478.6278 501.3280 522.8854 548.3691 593.5008 616.6130 617.0423 643.6153 698.7904 706.8091 710.6046 744.5783 751.6213 771.1748 791.2471 807.6125 829.1716 858.4376 858.7721 886.6906 920.6574 932.6204 939.3260 946.7221 980.2122 982.1706 983.6952 988.1977 990.2605 998.4316 1000.4441 1014.7881 1028.5208 1029.3867 1033.5008 1038.6314 1046.2388 1081.1595 1085.2928 1094.0857 1096.1636 1134.2609 1159.6714 1168.8274 1170.4601 1176.2709 1178.8670 1188.6443 1192.4896 1219.6393 1234.3623 1235.1422 1269.2497 1288.6803 1300.5376 1310.2498 1338.5540 1349.8017 1363.2633 1379.8795 1380.6408 1383.4554 1419.8104 1433.1837 1437.6838 1440.0531 1454.5248 1456.1052 1461.5849 1466.7723 1473.2060 1475.3482 1478.6896 1484.5648 1486.5585 1590.0200 1591.4785 1600.9558 1610.4362 1612.8739 2833.9298 2855.7323 2870.0508 3016.6210 3019.0129 3025.7844 3031.2213 3038.7938 3082.4423 3084.7083 3086.5231 3089.6097 3101.3654 3119.8250 3121.5352 3131.4761 3132.7402 3147.4004 3149.4693 3160.9346 3161.4133 3176.5860 3440.1921
redmass: 3.8471 3.4515 3.4714 4.7826 3.6812 4.2845 5.3664 4.1824 4.5037 3.6851 4.8226 2.3703 1.7353 4.6863 1.3375 4.2184 4.8282 2.3995 3.2037 2.9073 3.6276 3.1269 2.4646 1.9593 2.0518 2.8725 1.7322 1.9745 3.4236 4.1609 3.2984 3.7829 5.1763 4.4269 6.2930 6.3243 5.4887 5.3992 1.9265 1.7307 2.6643 2.1523 2.3523 3.4659 3.8143 4.3656 1.2460 1.2562 2.4563 1.8141 1.4405 2.0827 3.1841 1.6163 1.4951 1.9271 3.7071 5.0402 1.4955 1.3909 2.6316 2.1832 2.1388 1.5730 3.3618 1.8774 1.6012 1.4518 1.6650 1.8291 1.4742 2.8989 1.1675 1.0583 1.5468 1.8982 1.3002 1.1871 2.3290 1.5285 1.5666 2.3924 1.4206 1.3712 1.3480 1.2573 1.3237 1.5308 2.7536 2.7128 5.1250 1.1416 2.2186 1.1306 2.0914 1.1243 1.1185 1.0582 1.0876 1.0891 2.0708 1.0650 1.0535 2.2099 6.3056 5.9267 8.7320 6.6640 5.9847 1.0702 1.0568 1.0570 1.0609 1.0593 1.0731 1.0730 1.0869 1.1022 1.1013 1.1015 1.1036 1.0903 1.0864 1.0847 1.0917 1.0892 1.0954 1.0937 1.0978 1.1002 1.0952 1.0649
irintensity: 0.0729 0.2462 0.2690 0.0782 0.6634 0.5701 0.9656 0.1399 0.3671 1.3519 1.8846 0.8716 1.4060 1.4438 0.0385 1.7483 1.6280 0.6708 4.2322 24.6842 11.3283 41.0013 5.8631 17.1320 18.9693 0.6694 36.7680 4.9680 3.7066 1.7189 18.0012 14.1284 25.4810 22.8331 0.2662 0.8300 12.8270 7.3152 2.2474 121.3750 16.6119 6.7663 32.9693 27.2915 4.9325 3.1010 0.6351 0.5603 4.3348 10.1681 4.3808 24.4740 5.2741 3.5687 2.3595 13.9649 0.2741 0.2581 1.2250 1.7158 7.3745 20.7159 7.7777 15.4936 93.5440 13.4391 5.2820 5.9614 25.4855 38.7994 6.8814 215.4972 32.4656 0.6793 3.1826 50.8307 1.3268 1.1551 3.3417 13.4958 54.8245 12.6530 9.6798 14.5803 0.5828 0.7071 9.1037 25.7305 1.2463 3.6546 1.3495 3.1137 12.8751 2.4419 10.7376 3.6749 15.0992 5.5077 3.6188 21.5778 34.2315 33.8082 13.0460 17.0095 0.0314 2.4451 118.7670 32.3051 9.3374 76.6527 64.1652 278.9713 17.1428 25.0082 33.4542 37.9708 13.4299 8.1343 8.3350 62.2808 15.1796 8.5527 0.1165 0.3160 18.6159 16.0187 37.7367 32.8582 16.2742 23.6929 11.5760 54.6184
temp: 298.150 k
press: 1.00000 atm
elementType: 8 8 8 7 6 6 6 6 6 6 6 6 6 6 6 6 6 6 6 6 6 6 6 1 1 1 1 1 1 1 1 1 1 1 1 1 1 1 1 1 1 1 1 1 1 1
symmnumber: 1
zpe: 991669.7 jmol-1
zpe.correction: 0.377707 hartree
zpe.thermalcorrener: 0.400472 hartree
zpe.thermalcorrenthalpy: 0.401416 hartree
zpe.thermalcorrgfe: 0.323636 hartree
zpe.sumelectzpe: -1016.518195 hartree
zpe.sumelectthermal: -1016.495431 hartree
zpe.sumelectthermalent: -1016.494487 hartree
zpe.sumelectthermalfe: -1016.572266 hartree
dipole: 2.0189 -4.1783 -0.3486
dipole: 4.6535
quadrupole: -122.9094 -124.0395 -142.4231
quadrupole: -4.1691 2.7000 1.8026
quadrupole: 6.8813 5.7512 -12.6324 -4.1691 2.7000 1.8026
hfenergy: -1016.8959025 hartree
pointgroup: C01 [X(C19H23N1O3)]
dipole: 0.169734 1.8004547 -0.2855329 debye
polarizability: 269.1766911|-16.4855371|228.6755965|-16.910066|-22.9118207|150.1634645 unknown
InChI: InChI=1S/C19H23NO3/c1-20(2)13-14-23-18(21)19(22,17-11-7-4-8-12-17)15-16-9-5-3-6-10-16/h3-12,22H,13-15H2,1-2H3
charge 0 multiplicity 1
46 atoms
O  0.32429 -2.425118 1.179354
O  0.54932 1.181654 0.626804
O  0.049595 -0.113099 2.492949
N  -0.865584 3.594179 -0.546587
C  0.708811 -1.247679 0.40541
C  -0.156997 -1.207832 -0.901933
C  2.216067 -1.317936 0.061252
C  -1.650611 -1.068549 -0.653086
C  0.407473 -0.012282 1.291542
C  2.850093 -0.302212 -0.70049
C  2.972797 -2.437034 0.483645
C  0.226877 2.41978 1.399377
C  0.256236 3.589901 0.417962
C  -2.429779 -2.200653 -0.298318
C  -2.290004 0.194428 -0.766366
C  4.219673 -0.406355 -1.02782
C  4.343681 -2.538839 0.155004
C  4.973373 -1.524899 -0.601553
C  -3.817911 -2.077434 -0.066496
C  -3.680184 0.316653 -0.535655
C  -4.449394 -0.817165 -0.186493
C  -2.158294 3.963557 0.067585
C  -0.568643 4.40892 -1.744244
H  0.066934 -2.153365 -1.429085
H  0.207459 -0.376827 -1.528967
H  2.281091 0.575791 -1.023167
H  2.467128 -3.216977 1.058996
H  0.994861 2.54229 2.185004
H  -0.7523 2.278008 1.88799
H  0.037305 -2.109383 2.081919
H  1.203581 3.539888 -0.149663
H  0.291376 4.53385 1.024811
H  -1.937301 -3.173777 -0.199288
H  -1.700079 1.084205 -1.025597
H  4.698996 0.385825 -1.614495
H  4.917433 -3.411171 0.488399
H  6.036281 -1.604003 -0.856592
H  -4.406592 -2.961563 0.204443
H  -4.16404 1.295823 -0.63455
H  -5.527489 -0.721562 -0.012502
H  -2.424911 3.255723 0.871077
H  -2.954123 3.911347 -0.696054
H  -2.157624 4.997405 0.497694
H  0.351631 4.037861 -2.228785
H  -0.43148 5.49729 -1.52115
H  -1.396619 4.313936 -2.468786
