program: Orca
programVersion: 5.0.2
elementType: Cl P O O O O O N C C C C C C C C C C H H H H H H H H H H H H H H H H H H H
charge: 0
multiplicity: 1
keywords: wb97x-d3
keywords: def2-TZVPP
keywords: def2/J RIJCOSX
keywords: DEFGRID2
keywords: scfconv7
keywords: smallprint printgap noloewdin
keywords: NOSOSCF
formula: C10H19ClNO5P
InChI: InChI=1/C10H19ClNO5P/c1-6-12(7-2)10(13)9(11)8(3)17-18(14,15-4)16-5/h6-7H2,1-5H3
37 atoms
Cl -2.414028 -1.992925 1.120857
P  2.232371 -0.468056 -0.289249
O  0.70678 -0.605276 -0.822809
O  -0.670429 0.775305 1.890202
O  3.024464 -0.191697 -1.628508
O  2.221315 0.925309 0.470864
O  2.731813 -1.631871 0.46107
N  -1.967912 1.270082 0.104948
C  -2.086337 2.666138 0.508382
C  -2.717963 0.863497 -1.075486
C  -1.247562 0.438132 0.863891
C  -3.199262 2.893336 1.516854
C  -2.022976 1.215302 -2.378077
C  -1.177485 -0.999834 0.434254
C  -0.196672 -1.510959 -0.302889
C  0.000814 -2.933627 -0.684438
C  2.773862 0.926148 -2.488356
C  2.60061 1.026287 1.852471
H  -1.131755 3.008534 0.906657
H  -2.273403 3.252637 -0.391484
H  -2.917448 -0.205627 -1.03797
H  -3.693658 1.351621 -1.027843
H  -3.271802 3.954519 1.758512
H  -4.165895 2.577857 1.121342
H  -3.016572 2.352219 2.445181
H  -1.068042 0.698876 -2.472046
H  -2.648034 0.919867 -3.221409
H  -1.83984 2.287149 -2.465332
H  0.728662 -3.418551 -0.031541
H  -0.926371 -3.498617 -0.6254
H  0.374976 -3.000929 -1.706271
H  3.426034 0.807855 -3.349945
H  3.009931 1.866338 -1.99051
H  1.739083 0.944019 -2.831383
H  2.362912 2.040418 2.162259
H  3.670114 0.857407 1.972123
H  2.049059 0.325372 2.476038
elementType: Cl P O N C H
totalener: -1625.17653724 hartree
nucrepener: 1856.51733849 hartree
electener: -3481.69387573 hartree
oneelecener: -5926.48586385 hartree
twoeener: 2444.79198812 hartree
cpcmener: -0.03355155 hartree
kineticenergy: 1620.09209342 hartree
xcener: -115.227532393777 hartree
chargesum: -0.0000000
charge: -0.077795 0.945966 -0.347618 -0.517078 -0.345519 -0.347609 -0.611554 -0.085313 -0.034916 -0.046938 0.326690 -0.251757 -0.245421 -0.034402 0.166171 -0.247107 -0.106731 -0.123008 0.088673 0.096937 0.101588 0.101940 0.096412 0.082069 0.086170 0.074433 0.095800 0.085868 0.117178 0.098612 0.113022 0.127400 0.117648 0.119415 0.129929 0.133824 0.117020
qa: -0.0778 0.9460 -0.3476 -0.5171 -0.3455 -0.3476 -0.6116 -0.0853 -0.0349 -0.0469 0.3267 -0.2518 -0.2454 -0.0344 0.1662 -0.2471 -0.1067 -0.1230 0.0887 0.0969 0.1016 0.1019 0.0964 0.0821 0.0862 0.0744 0.0958 0.0859 0.1172 0.0986 0.1130 0.1274 0.1176 0.1194 0.1299 0.1338 0.1170
va: 1.2473 5.5681 2.0742 1.9805 2.1211 2.0554 2.0050 3.1909 3.8785 3.9145 4.1371 3.9149 3.9134 3.9628 3.7893 3.9507 3.8464 3.8276 1.0143 0.9977 1.0018 0.9943 1.0059 1.0046 1.0108 1.0074 1.0084 1.0051 1.0072 1.0174 1.0034 0.9892 0.9940 0.9829 0.9886 0.9935 0.9992
dispcorr: -0.020038858 hartree
energy: -1625.196576096738
dipole: -6.97592 5.68345 -1.29247 19.50173 -17.60275 1.89899 -9.49252 7.09131 -2.40121
magnitude: 3.32302 au
magnitude: 8.44643 debye
