program: Orca
programVersion: 5.0.2
elementType: Cl P O O O O O N C C C C C C C C C C H H H H H H H H H H H H H H H H H H H
charge: 0
multiplicity: 1
keywords: wb97x-d3
keywords: def2-TZVPP
keywords: def2/J RIJCOSX
keywords: DEFGRID2
keywords: scfconv7
keywords: smallprint printgap noloewdin
keywords: NOSOSCF
formula: C10H19ClNO5P
InChI: InChI=1/C10H19ClNO5P/c1-6-12(7-2)10(13)9(11)8(3)17-18(14,15-4)16-5/h6-7H2,1-5H3
37 atoms
Cl -2.188319 -2.221139 1.054521
P  2.218353 -0.242486 -0.441234
O  0.717936 -0.529209 -0.980753
O  -0.922094 0.551335 1.999049
O  2.745976 0.744835 -1.554878
O  1.966273 0.647311 0.847675
O  3.064651 -1.433368 -0.261526
N  -1.7973 1.188231 0.013512
C  -1.985556 2.556798 0.482164
C  -2.310922 0.87567 -1.313984
C  -1.250192 0.29668 0.847429
C  -0.748281 3.415007 0.284042
C  -3.794364 0.550531 -1.304207
C  -1.069216 -1.10961 0.350623
C  -0.081146 -1.518924 -0.439722
C  0.217947 -2.904384 -0.883407
C  2.165066 2.029225 -1.812114
C  2.55463 0.347608 2.119592
H  -2.82452 2.980393 -0.070198
H  -2.27954 2.546019 1.531199
H  -2.115793 1.739351 -1.951713
H  -1.75549 0.049407 -1.749633
H  -0.471589 3.475533 -0.769484
H  -0.939675 4.430051 0.634479
H  0.103813 3.026314 0.841319
H  -4.387542 1.371559 -0.899103
H  -4.141342 0.361219 -2.320672
H  -3.998804 -0.340587 -0.709697
H  0.43041 -2.915753 -1.953101
H  1.09488 -3.301912 -0.370207
H  -0.61278 -3.578779 -0.694302
H  2.32943 2.706318 -0.974882
H  1.098134 1.952032 -2.021891
H  2.6675 2.425296 -2.691005
H  3.629621 0.193008 2.038639
H  2.091832 -0.531215 2.565425
H  2.368849 1.209419 2.7545
elementType: Cl P O N C H
totalener: -1625.17708645 hartree
nucrepener: 1881.94913233 hartree
electener: -3507.12621878 hartree
oneelecener: -5976.88359859 hartree
twoeener: 2469.75737981 hartree
cpcmener: -0.03503355 hartree
kineticenergy: 1620.10905220 hartree
xcener: -115.231060691593 hartree
chargesum: -0.0000000
charge: -0.078816 0.923410 -0.346578 -0.511436 -0.342511 -0.331268 -0.611005 -0.084029 -0.019096 -0.047431 0.298341 -0.267451 -0.254597 -0.022100 0.170428 -0.235980 -0.106070 -0.116123 0.096508 0.088568 0.102775 0.104086 0.079206 0.103669 0.082589 0.087006 0.095630 0.079881 0.113208 0.113148 0.093923 0.118332 0.114294 0.133265 0.126949 0.124838 0.124436
qa: -0.0788 0.9234 -0.3466 -0.5114 -0.3425 -0.3313 -0.6110 -0.0840 -0.0191 -0.0474 0.2983 -0.2675 -0.2546 -0.0221 0.1704 -0.2360 -0.1061 -0.1161 0.0965 0.0886 0.1028 0.1041 0.0792 0.1037 0.0826 0.0870 0.0956 0.0799 0.1132 0.1131 0.0939 0.1183 0.1143 0.1333 0.1269 0.1248 0.1244
va: 1.2448 5.5853 2.0821 1.9913 2.1223 2.0564 2.0127 3.1402 3.8439 3.8806 4.1974 3.9338 3.9301 3.9547 3.7597 3.9524 3.8482 3.8363 0.9985 1.0182 0.9925 0.9994 1.0015 1.0102 1.0106 1.0047 1.0080 1.0131 1.0028 1.0097 1.0205 0.9891 0.9851 0.9913 0.9961 0.9888 0.9893
dispcorr: -0.021708364 hartree
energy: -1625.198794814220
dipole: -6.36903 5.10991 -1.25911 19.76900 -17.79046 1.97854 -7.29373 5.57006 -1.72367
magnitude: 2.91050 au
magnitude: 7.39790 debye
