program: Orca
programVersion: 5.0.2
elementType: Cl P O O O O O N C C C C C C C C C C H H H H H H H H H H H H H H H H H H H
charge: 0
multiplicity: 1
keywords: wb97x-d3
keywords: def2-TZVPP
keywords: def2/J RIJCOSX
keywords: DEFGRID2
keywords: scfconv7
keywords: smallprint printgap noloewdin
keywords: NOSOSCF
formula: C10H19ClNO5P
InChI: InChI=1/C10H19ClNO5P/c1-6-12(7-2)10(13)9(11)8(3)17-18(14,15-4)16-5/h6-7H2,1-5H3
37 atoms
Cl -2.109522 -2.142941 1.198016
P  2.22674 -0.273819 -0.891518
O  0.613004 -0.312934 -0.948099
O  -0.469872 0.754675 1.90435
O  2.520694 1.267659 -1.076256
O  2.470145 -0.666134 0.63021
O  2.941253 -1.081777 -1.893688
N  -2.065063 1.189232 0.358183
C  -2.242242 2.556027 0.832236
C  -2.93785 0.757325 -0.725171
C  -1.171052 0.400941 0.965328
C  -3.214479 2.64751 1.995752
C  -2.450475 1.190357 -2.095688
C  -1.049058 -1.00465 0.449201
C  -0.131455 -1.360521 -0.442616
C  0.145176 -2.712105 -0.990151
C  1.958849 2.290808 -0.246689
C  3.750285 -1.160563 1.04735
H  -1.274028 2.973477 1.107177
H  -2.606978 3.148643 -0.007319
H  -3.058588 -0.32384 -0.69971
H  -3.92979 1.17069 -0.530775
H  -3.35235 3.689321 2.287455
H  -4.19338 2.246046 1.729025
H  -2.848673 2.102672 2.865954
H  -2.30084 2.26953 -2.15055
H  -1.511622 0.703795 -2.358091
H  -3.18855 0.922752 -2.852492
H  -0.646605 -3.413194 -0.739685
H  0.230783 -2.669324 -2.076438
H  1.080091 -3.119426 -0.598327
H  2.53689 3.192871 -0.43293
H  2.028809 2.042154 0.811791
H  0.918791 2.475723 -0.514843
H  4.533847 -0.4201 0.884327
H  4.005517 -2.08191 0.52442
H  3.672109 -1.365297 2.111948
elementType: Cl P O N C H
totalener: -1625.17948071 hartree
nucrepener: 1859.06815635 hartree
electener: -3484.24763706 hartree
oneelecener: -5931.22258737 hartree
twoeener: 2446.97495031 hartree
cpcmener: -0.03655305 hartree
kineticenergy: 1620.10488412 hartree
xcener: -115.229834939145 hartree
chargesum: 0.0000000
charge: -0.075626 0.896400 -0.332919 -0.512692 -0.341926 -0.322842 -0.609650 -0.073331 -0.032563 -0.047555 0.308547 -0.253730 -0.259443 -0.007795 0.120144 -0.227665 -0.099811 -0.114600 0.083024 0.101180 0.101172 0.103784 0.096430 0.083173 0.086099 0.085823 0.085693 0.097433 0.093464 0.118703 0.114010 0.134334 0.117206 0.111531 0.127958 0.118887 0.127153
qa: -0.0756 0.8964 -0.3329 -0.5127 -0.3419 -0.3228 -0.6096 -0.0733 -0.0326 -0.0476 0.3085 -0.2537 -0.2594 -0.0078 0.1201 -0.2277 -0.0998 -0.1146 0.0830 0.1012 0.1012 0.1038 0.0964 0.0832 0.0861 0.0858 0.0857 0.0974 0.0935 0.1187 0.1140 0.1343 0.1172 0.1115 0.1280 0.1189 0.1272
va: 1.2486 5.6231 2.0844 1.9817 2.1197 2.0557 2.0102 3.1649 3.8719 3.9082 4.1619 3.9280 3.9119 3.9204 3.8122 3.9443 3.8373 3.8351 1.0155 0.9960 1.0045 0.9949 1.0055 1.0046 1.0100 1.0046 1.0087 1.0084 1.0222 1.0050 0.9997 0.9908 0.9990 0.9879 0.9871 0.9962 0.9904
dispcorr: -0.020773313 hartree
energy: -1625.200254022122
dipole: -8.14785 6.72745 -1.42039 16.43326 -15.42165 1.01161 -1.77356 1.74600 -0.02755
magnitude: 1.74402 au
magnitude: 4.43296 debye
