program: Orca
programVersion: 5.0.2
elementType: Cl P O O O O O N C C C C C C C C C C H H H H H H H H H H H H H H H H H H H
charge: 0
multiplicity: 1
keywords: wb97x-d3
keywords: def2-TZVPP
keywords: def2/J RIJCOSX
keywords: DEFGRID2
keywords: scfconv7
keywords: smallprint printgap noloewdin
keywords: NOSOSCF
formula: C10H19ClNO5P
InChI: InChI=1/C10H19ClNO5P/c1-6-12(7-2)10(13)9(11)8(3)17-18(14,15-4)16-5/h6-7H2,1-5H3
37 atoms
Cl -2.358656 -1.877138 1.081804
P  2.227505 0.001785 0.272766
O  0.996428 -0.643815 -0.560102
O  -0.735242 1.201744 1.314575
O  3.484387 -0.335387 -0.639168
O  2.044522 1.540859 -0.043023
O  2.293219 -0.42287 1.682487
N  -2.112959 1.069962 -0.475853
C  -2.371216 2.505074 -0.453104
C  -2.685715 0.321263 -1.586153
C  -1.292054 0.546691 0.442059
C  -1.330122 3.308051 -1.213555
C  -4.177231 0.074035 -1.445734
C  -1.071338 -0.939703 0.413217
C  0.070018 -1.491828 0.014487
C  0.455126 -2.923408 0.031792
C  4.012497 -1.665427 -0.689884
C  2.377751 2.546525 0.92361
H  -3.355676 2.669936 -0.891051
H  -2.434173 2.842226 0.580462
H  -2.488149 0.882155 -2.502838
H  -2.156117 -0.623495 -1.696262
H  -1.27767 3.006505 -2.260444
H  -1.589815 4.366946 -1.188516
H  -0.337531 3.197475 -0.77823
H  -4.405594 -0.50728 -0.553434
H  -4.744311 1.004371 -1.398915
H  -4.537821 -0.482711 -2.311363
H  1.318013 -3.077178 0.683933
H  -0.349417 -3.562292 0.385726
H  0.735474 -3.252304 -0.970406
H  4.94448 -1.610815 -1.246758
H  3.330536 -2.339309 -1.20961
H  4.220116 -2.053475 0.307441
H  3.458193 2.630188 1.03748
H  1.924644 2.342752 1.89197
H  1.987898 3.484827 0.539581
elementType: Cl P O N C H
totalener: -1625.17732609 hartree
nucrepener: 1856.62829486 hartree
electener: -3481.80562095 hartree
oneelecener: -5927.43382474 hartree
twoeener: 2445.62820379 hartree
cpcmener: -0.03729031 hartree
kineticenergy: 1620.10556035 hartree
xcener: -115.230107014855 hartree
chargesum: 0.0000000
charge: -0.078123 0.947158 -0.364843 -0.508020 -0.344297 -0.350382 -0.604999 -0.090241 -0.034106 -0.065129 0.314063 -0.246113 -0.236370 -0.033678 0.184597 -0.227365 -0.128330 -0.120483 0.099026 0.089940 0.101666 0.111478 0.082975 0.096364 0.076452 0.075025 0.086955 0.093769 0.110958 0.095003 0.113237 0.132196 0.123491 0.121698 0.136215 0.119260 0.120956
qa: -0.0781 0.9472 -0.3648 -0.5080 -0.3443 -0.3504 -0.6050 -0.0902 -0.0341 -0.0651 0.3141 -0.2461 -0.2364 -0.0337 0.1846 -0.2274 -0.1283 -0.1205 0.0990 0.0899 0.1017 0.1115 0.0830 0.0964 0.0765 0.0750 0.0870 0.0938 0.1110 0.0950 0.1132 0.1322 0.1235 0.1217 0.1362 0.1193 0.1210
va: 1.2447 5.5897 2.0836 1.9890 2.1130 2.0862 1.9711 3.1960 3.8667 3.9129 4.1733 3.9289 3.9021 3.9993 3.7858 3.9543 3.8503 3.8371 0.9996 1.0167 0.9948 0.9939 1.0055 1.0071 1.0054 1.0175 1.0049 1.0080 1.0052 1.0264 0.9993 0.9907 0.9844 0.9920 0.9918 0.9966 0.9855
dispcorr: -0.020177496 hartree
energy: -1625.197503584197
dipole: -4.48801 4.11343 -0.37458 10.57985 -10.96949 -0.38965 -13.25596 10.66043 -2.59553
magnitude: 2.65121 au
magnitude: 6.73884 debye
