program: Orca
programVersion: 5.0.2
elementType: Cl P O O O O O N C C C C C C C C C C H H H H H H H H H H H H H H H H H H H
charge: 0
multiplicity: 1
keywords: wb97x-d3
keywords: def2-TZVPP
keywords: def2/J RIJCOSX
keywords: DEFGRID2
keywords: scfconv7
keywords: smallprint printgap noloewdin
keywords: NOSOSCF
formula: C10H19ClNO5P
InChI: InChI=1/C10H19ClNO5P/c1-6-12(7-2)10(13)9(11)8(3)17-18(14,15-4)16-5/h6-7H2,1-5H3
37 atoms
Cl -2.622305 -1.81221 0.594083
P  2.208235 -0.59904 -0.630302
O  1.240462 -1.100499 0.555736
O  -0.57832 0.587244 2.237451
O  1.313815 0.560126 -1.254253
O  3.378905 0.072089 0.193592
O  2.706964 -1.619661 -1.567118
N  -1.595045 1.281055 0.343371
C  -1.662716 2.651551 0.839498
C  -2.030694 1.049277 -1.025537
C  -1.049645 0.347111 1.133004
C  -2.781635 2.889803 1.840089
C  -3.520027 1.258416 -1.232532
C  -1.058014 -1.073255 0.640112
C  0.047823 -1.769905 0.385897
C  0.166679 -3.20254 0.017763
C  1.665118 1.150577 -2.512286
C  3.185604 1.210923 1.044263
H  -0.701519 2.92361 1.279527
H  -1.799269 3.298722 -0.027041
H  -1.472818 1.728171 -1.675752
H  -1.748963 0.044274 -1.332538
H  -2.789522 3.940035 2.135072
H  -3.757975 2.65642 1.414624
H  -2.652321 2.295143 2.74351
H  -3.819271 2.289867 -1.043404
H  -3.777865 1.031496 -2.267707
H  -4.111269 0.60723 -0.589163
H  -0.786207 -3.720699 0.075144
H  0.551301 -3.316774 -0.997251
H  0.866494 -3.701358 0.690694
H  2.594828 1.715443 -2.435349
H  0.858265 1.830047 -2.774714
H  1.762802 0.394813 -3.291441
H  2.231208 1.184734 1.570465
H  3.254565 2.130067 0.463717
H  3.985937 1.192494 1.780275
elementType: Cl P O N C H
totalener: -1625.17738784 hartree
nucrepener: 1865.31933749 hartree
electener: -3490.49672534 hartree
oneelecener: -5943.43427277 hartree
twoeener: 2452.93754743 hartree
cpcmener: -0.03580970 hartree
kineticenergy: 1620.08590589 hartree
xcener: -115.227044689173 hartree
chargesum: -0.0000000
charge: -0.080419 0.888302 -0.331718 -0.514023 -0.311318 -0.336262 -0.608013 -0.071952 -0.050697 -0.080437 0.322641 -0.252813 -0.249644 -0.076844 0.204657 -0.213146 -0.110358 -0.102615 0.094108 0.096556 0.096106 0.111729 0.097136 0.086100 0.087703 0.091223 0.099067 0.080680 0.089465 0.107674 0.115335 0.127960 0.111888 0.122859 0.113346 0.117306 0.128416
qa: -0.0804 0.8883 -0.3317 -0.5140 -0.3113 -0.3363 -0.6080 -0.0720 -0.0507 -0.0804 0.3226 -0.2528 -0.2496 -0.0768 0.2047 -0.2131 -0.1104 -0.1026 0.0941 0.0966 0.0961 0.1117 0.0971 0.0861 0.0877 0.0912 0.0991 0.0807 0.0895 0.1077 0.1153 0.1280 0.1119 0.1229 0.1133 0.1173 0.1284
va: 1.2431 5.6087 2.1228 1.9821 2.0596 2.1035 2.0165 3.1167 3.8746 3.9043 4.1498 3.9013 3.9216 3.8953 3.7985 3.9551 3.8459 3.8423 1.0117 0.9990 0.9953 0.9971 1.0060 1.0016 1.0132 0.9985 1.0085 1.0142 1.0219 1.0127 1.0014 0.9851 0.9902 0.9976 0.9963 0.9873 0.9919
dispcorr: -0.020858439 hartree
energy: -1625.198246281411
dipole: -8.23049 7.18755 -1.04294 21.16774 -18.90578 2.26196 -5.20097 3.61745 -1.58352
magnitude: 2.95157 au
magnitude: 7.50228 debye
