program: Orca
programVersion: 5.0.2
elementType: Cl P O O O O O N C C C C C C C C C C H H H H H H H H H H H H H H H H H H H
charge: 0
multiplicity: 1
keywords: wb97x-d3
keywords: def2-TZVPP
keywords: def2/J RIJCOSX
keywords: DEFGRID2
keywords: scfconv7
keywords: smallprint printgap noloewdin
keywords: NOSOSCF
formula: C10H19ClNO5P
InChI: InChI=1/C10H19ClNO5P/c1-6-12(7-2)10(13)9(11)8(3)17-18(14,15-4)16-5/h6-7H2,1-5H3
37 atoms
Cl -2.50976 -1.553527 -1.505884
P  2.154754 -0.195694 -0.203614
O  0.848492 -0.894818 0.444717
O  -1.033771 1.360629 -1.412202
O  1.800705 1.341338 -0.100466
O  3.197612 -0.351168 0.981164
O  2.53318 -0.719527 -1.52897
N  -1.787051 1.081251 0.703534
C  -1.959709 2.516836 0.885971
C  -2.283013 0.224798 1.771884
C  -1.324905 0.635873 -0.469434
C  -3.283253 3.023415 0.33795
C  -1.359196 0.158217 2.974638
C  -1.187475 -0.849482 -0.644927
C  -0.114069 -1.551814 -0.296977
C  0.15644 -2.990997 -0.531395
C  2.244084 2.307894 -1.062685
C  3.700833 -1.643755 1.341524
H  -1.895811 2.723089 1.954551
H  -1.125435 3.04188 0.421897
H  -3.260601 0.608115 2.074074
H  -2.460995 -0.777136 1.386032
H  -4.1281 2.512566 0.802473
H  -3.388265 4.089272 0.544251
H  -3.351669 2.884259 -0.740673
H  -0.399908 -0.289626 2.719519
H  -1.170508 1.145026 3.399521
H  -1.817134 -0.450002 3.755248
H  0.329507 -3.500149 0.418699
H  -0.666255 -3.488434 -1.03728
H  1.05409 -3.116838 -1.139577
H  1.443366 3.031838 -1.19045
H  2.467805 1.853747 -2.026912
H  3.132924 2.812275 -0.686357
H  4.099457 -2.174852 0.476687
H  2.923418 -2.2464 1.81246
H  4.50308 -1.480088 2.056566
elementType: Cl P O N C H
totalener: -1625.17752560 hartree
nucrepener: 1865.86426611 hartree
electener: -3491.04179171 hartree
oneelecener: -5945.48432373 hartree
twoeener: 2454.44253202 hartree
cpcmener: -0.03439762 hartree
kineticenergy: 1620.10528949 hartree
xcener: -115.229260005043 hartree
chargesum: 0.0000000
charge: -0.076142 0.937661 -0.353725 -0.509608 -0.345660 -0.342640 -0.607920 -0.071332 -0.036112 -0.047049 0.301037 -0.252800 -0.255381 -0.037201 0.178168 -0.227264 -0.096221 -0.116800 0.098946 0.088282 0.102436 0.103043 0.082234 0.096895 0.085964 0.084907 0.085828 0.094786 0.111195 0.091476 0.107165 0.110395 0.115964 0.127582 0.119249 0.121115 0.131525
qa: -0.0761 0.9377 -0.3537 -0.5096 -0.3457 -0.3426 -0.6079 -0.0713 -0.0361 -0.0470 0.3010 -0.2528 -0.2554 -0.0372 0.1782 -0.2273 -0.0962 -0.1168 0.0989 0.0883 0.1024 0.1030 0.0822 0.0969 0.0860 0.0849 0.0858 0.0948 0.1112 0.0915 0.1072 0.1104 0.1160 0.1276 0.1192 0.1211 0.1315
va: 1.2475 5.6039 2.0733 1.9877 2.1068 2.1097 1.9894 3.1626 3.8908 3.9122 4.1602 3.9122 3.9106 3.9788 3.7756 3.9677 3.8341 3.8376 0.9978 1.0097 0.9947 0.9972 1.0046 1.0058 1.0115 1.0115 1.0050 1.0077 0.9997 1.0241 1.0124 0.9924 1.0009 0.9902 0.9931 0.9898 0.9897
dispcorr: -0.020393456 hartree
energy: -1625.197919056022
dipole: -2.01998 1.89156 -0.12842 9.27213 -9.73983 -0.46770 16.71886 -13.81137 2.90749
magnitude: 2.94767 au
magnitude: 7.49238 debye
