program: Gaussian 09
title: 000058825
version: EM64L-G09RevD.01
frameworkgroup: C1[X(C18H23NO3)]
method: RPBEPBE
basis: SDD
operation: Freq
keyword: #p
keyword: freq=noraman
keyword: PBEPBE/SDD
title: #p freq=noraman PBEPBE/SDD
converged: YES YES NO NO
title: Mulliken charges:
elementType: O O O N C C C C C C C C C C C C C C C C C C H H H H H H H H H H H H H H H H H H H H H H H
charge: -0.333831 -0.231955 -0.487373 0.003455 -0.183623 0.006004 -0.454190 -0.463583 -0.493768 -0.450515 -0.443806 0.215832 -0.083470 0.399267 -0.189741 -0.383958 -0.394504 -0.160659 -0.236415 -0.221519 -0.243556 -0.744360 0.238100 0.256555 0.214538 0.221350 0.217983 0.217536 0.252321 0.247371 0.239490 0.227545 0.232106 0.229034 0.257292 0.370109 0.267180 0.276682 0.262756 0.225069 0.224595 0.227298 0.224194 0.224716 0.222451
chargesum: 0.00000
title: Mulliken charges with hydrogens summed into heavy atoms:
elementType: O O O N C C C C C C C C C C C C C C C C C C
charge: -0.333831 -0.231955 -0.117264 0.003455 0.054477 0.262559 -0.018302 -0.028064 0.005924 0.016520 0.017334 0.215832 -0.083470 0.399267 0.067550 -0.116778 -0.117822 0.102096 -0.011346 0.003076 -0.016258 -0.073000
polarizability: 2.23895650e+02 1.33279149e+01 2.06384348e+02 -7.40415307e-01 6.83414463e+00 1.83903147e+02
1716.lowfreq: -22.8785 -9.4699 -5.7835 -0.0008 -0.0008 -0.0007 7.6738 16.4637 31.5189
frequency: -17.8577 15.9331 31.0940 36.4042 46.9969 65.6426 88.9245 108.9121 133.0693 150.4099 187.4124 194.1007 212.8915 223.8273 254.0838 274.4900 298.7256 306.8496 324.1448 335.3213 370.5026 388.4682 397.5498 408.1799 416.1912 442.2017 503.7995 535.3530 542.2970 580.4644 598.0048 602.1557 615.3737 669.0319 698.6958 711.3779 742.0503 753.8893 776.1011 783.0047 789.5267 805.6468 818.7634 833.1909 864.6059 870.8627 888.4998 909.9005 923.4091 936.4571 942.8046 957.1413 976.4286 984.4484 986.9307 987.6298 991.5813 998.0729 1000.9129 1020.2694 1028.5996 1048.7299 1051.5309 1070.8579 1074.5077 1091.0289 1096.9076 1119.6051 1129.9317 1150.6971 1162.6671 1168.2185 1171.8905 1190.4261 1200.1491 1214.7759 1229.4476 1260.0493 1269.9667 1290.2324 1294.5411 1301.5220 1306.1857 1308.0768 1312.1572 1313.1849 1315.0010 1328.7697 1331.3791 1347.1548 1362.5269 1380.3078 1394.0871 1433.0066 1443.7508 1456.3307 1461.9070 1466.0744 1467.9435 1470.6353 1475.0704 1481.2367 1590.9835 1606.0465 1630.9310 1688.3105 2966.6896 2986.3250 2995.4327 3004.9509 3007.9506 3011.4749 3030.9452 3041.2071 3042.6795 3048.7971 3051.6561 3069.7711 3077.7174 3077.9591 3080.1741 3122.0045 3125.9816 3131.5525 3133.5196 3144.6182 3157.9209 3170.1527 3523.5870
redmass: 3.9682 3.5355 3.8837 3.7821 3.8607 4.3447 3.4617 2.6784 1.8657 3.5732 3.4345 1.5819 3.1978 4.9463 3.6026 2.4425 3.9669 3.5021 2.1711 2.8160 2.6145 2.7261 2.3923 2.6092 2.2898 3.8483 3.8124 4.1470 4.9772 5.2775 5.7937 5.0988 6.4103 4.9220 5.6303 1.8934 3.6046 2.7337 2.2872 1.4348 2.1564 1.6058 3.3571 2.1484 1.2423 3.0046 3.1360 2.6980 2.7998 2.0147 1.6862 3.0458 1.0833 2.6441 2.6473 2.2533 1.9759 2.8041 1.3663 2.7834 2.2021 1.5442 2.8342 2.2199 2.2453 2.3438 1.6706 2.6895 1.5088 3.7860 2.4756 1.2608 1.1678 1.1744 1.3285 1.4092 1.2680 1.3152 1.4622 1.2589 1.3079 1.2982 1.2943 1.4009 1.3435 1.3786 1.3344 1.2992 1.4597 1.3698 1.4878 8.6989 1.2357 2.2237 1.0798 1.0787 1.0477 1.0836 1.0843 1.0660 2.1257 1.0882 6.2815 5.9946 11.7622 6.3652 1.0364 1.0599 1.0593 1.0605 1.0616 1.0622 1.0864 1.0969 1.1028 1.0923 1.0990 1.1058 1.1057 1.0986 1.1050 1.0847 1.0952 1.0886 1.0866 1.0937 1.0975 1.0971 1.0648
irintensity: 0.2093 0.2587 1.3987 1.1778 0.1635 1.3729 1.0638 1.0370 0.4959 0.6388 2.8241 1.3137 1.7694 2.3413 6.4288 1.9557 3.8209 12.0471 43.9770 49.3112 23.2958 11.6410 18.5758 12.0618 2.1022 8.2458 6.6555 2.3693 3.7599 6.7930 9.3344 13.9364 0.1391 17.2713 5.0764 59.4943 28.2344 20.8482 21.1375 10.0131 5.1983 10.2842 13.2982 13.1933 0.0455 1.7113 6.2683 14.6514 78.3105 15.1547 14.1803 69.2277 41.0431 13.0859 28.0854 2.4724 9.0208 47.5803 1.8284 4.8283 8.7102 0.4658 51.1500 28.5304 59.1313 11.7565 0.7503 200.2079 6.3857 174.5670 26.9019 12.7119 1.7210 1.3154 13.4660 4.0745 1.1435 4.1315 5.3551 2.6454 3.7403 2.4838 1.6117 4.5988 1.3006 2.5584 4.5727 1.7508 58.7397 2.1140 3.5469 0.0796 10.5619 13.8368 14.5165 3.2704 13.8304 14.8917 12.8234 16.9937 26.3952 10.4108 0.8640 8.8331 117.4346 6.0667 43.1371 31.3585 21.6791 88.6493 69.3316 19.3667 6.0611 24.7551 8.5150 25.9409 10.2279 13.4263 83.0713 22.6526 42.7911 0.1418 1.1838 16.3489 6.8548 18.2941 24.7982 16.5425 73.4205
temp: 298.150 k
press: 1.00000 atm
elementType: 8 8 8 7 6 6 6 6 6 6 6 6 6 6 6 6 6 6 6 6 6 6 1 1 1 1 1 1 1 1 1 1 1 1 1 1 1 1 1 1 1 1 1 1 1
symmnumber: 1
zpe: 982740.7 jmol-1
zpe.correction: 0.374306 hartree
zpe.thermalcorrener: 0.394410 hartree
zpe.thermalcorrenthalpy: 0.395354 hartree
zpe.thermalcorrgfe: 0.324007 hartree
zpe.sumelectzpe: -978.447556 hartree
zpe.sumelectthermal: -978.427451 hartree
zpe.sumelectthermalent: -978.426507 hartree
zpe.sumelectthermalfe: -978.497855 hartree
dipole: 1.8884 -2.0367 0.9808
dipole: 2.9456
quadrupole: -123.7566 -126.3857 -129.2470
quadrupole: -5.5524 3.5354 1.2152
quadrupole: 2.7065 0.0774 -2.7839 -5.5524 3.5354 1.2152
hfenergy: -978.8218617 hartree
pointgroup: C01 [X(C18H23N1O3)]
dipole: 0.8053166 -0.7675029 0.3246921 debye
polarizability: 221.2115702|14.4993953|207.1719405|1.3640685|9.8346493|185.7996339 unknown
InChI: InChI=1S/C18H23NO3/c1-2-10-18(21,15-6-4-3-5-7-15)17(20)22-16-13-19-11-8-14(16)9-12-19/h2-7,10,14,16,21H,8-9,11-13H2,1H3
charge 0 multiplicity 1
45 atoms
O  0.840484 -0.115562 0.116285
O  -0.149995 0.43737 -1.921828
O  -1.196465 0.518911 1.579948
N  4.140366 1.206996 -0.049137
C  3.063243 -1.127659 0.369507
C  2.172031 -0.286484 -0.564852
C  3.279771 -0.391127 1.720324
C  4.436269 -1.292632 -0.344914
C  2.85966 1.10237 -0.80119
C  3.875564 1.032084 1.413835
C  5.075764 0.136957 -0.515617
C  -0.235239 0.261995 -0.687228
C  -1.529352 0.39308 0.163728
C  -2.411844 -0.864999 -0.089029
C  -2.283173 1.646795 -0.281273
C  -2.679128 -1.326783 -1.402659
C  -3.005718 -1.521682 1.014937
C  -2.584918 2.676894 0.54431
C  -3.523708 -2.441366 -1.604013
C  -3.850638 -2.635317 0.809232
C  -4.11253 -3.100361 -0.500036
C  -3.357334 3.907139 0.127397
H  2.59683 -2.114009 0.538362
H  1.973059 -0.809333 -1.517719
H  3.971632 -0.986585 2.344857
H  2.326372 -0.313192 2.271785
H  4.300525 -1.788195 -1.325514
H  5.083365 -1.950216 0.26443
H  3.062218 1.254321 -1.875316
H  2.185664 1.912049 -0.468546
H  3.177512 1.829861 1.724198
H  4.826463 1.193276 1.952235
H  6.007986 0.227669 0.0696
H  5.325965 0.337665 -1.57289
H  -2.586332 1.646672 -1.335671
H  -0.330874 0.053497 1.724019
H  -2.221398 -0.826654 -2.263636
H  -2.80289 -1.143513 2.021166
H  -2.252859 2.612659 1.588658
H  -3.720853 -2.794288 -2.622697
H  -4.306649 -3.13677 1.670713
H  -4.768046 -3.964201 -0.658393
H  -3.638272 3.873482 -0.93995
H  -4.283987 4.012756 0.724819
H  -2.762143 4.825226 0.299362
