program: Orca
programVersion: 5.0.2
elementType: Cl P O O O O O N C C C C C C C C C C H H H H H H H H H H H H H H H H H H H
charge: 0
multiplicity: 1
keywords: wb97x-d3
keywords: def2-TZVPP
keywords: def2/J RIJCOSX
keywords: DEFGRID2
keywords: scfconv7
keywords: smallprint printgap noloewdin
keywords: NOSOSCF
formula: C10H19ClNO5P
InChI: InChI=1/C10H19ClNO5P/c1-6-12(7-2)10(13)9(11)8(3)17-18(14,15-4)16-5/h6-7H2,1-5H3
37 atoms
Cl -1.905908 -2.076773 1.721348
P  2.084449 0.295226 -0.425829
O  0.636186 -0.367477 -0.72584
O  -0.921569 1.117395 1.787802
O  2.282764 0.116802 1.129453
O  3.147831 -0.75705 -0.962827
O  2.13429 1.648505 -1.004278
N  -2.254617 0.941637 -0.02994
C  -2.576574 2.364637 0.013263
C  -2.880539 0.14462 -1.075323
C  -1.393123 0.45703 0.869849
C  -1.478333 3.253314 -0.548257
C  -2.385469 0.464085 -2.474752
C  -0.993673 -0.985935 0.744628
C  0.059278 -1.367957 0.029796
C  0.645713 -2.725165 -0.090737
C  2.423374 1.225586 2.030713
C  3.334879 -0.934242 -2.372834
H  -3.495095 2.50354 -0.557211
H  -2.804752 2.651034 1.040863
H  -2.726464 -0.911511 -0.864842
H  -3.958532 0.311965 -1.017634
H  -1.802354 4.294595 -0.524382
H  -0.558736 3.180818 0.031185
H  -1.245406 3.001162 -1.58247
H  -2.620188 1.486852 -2.770669
H  -1.309155 0.320681 -2.563112
H  -2.871947 -0.200438 -3.189852
H  1.600823 -2.788644 0.435468
H  -0.010074 -3.483986 0.328232
H  0.826077 -2.971813 -1.137821
H  3.4792 1.461365 2.15224
H  2.008869 0.913962 2.98543
H  1.893907 2.111054 1.684593
H  4.067939 -1.727805 -2.491711
H  3.716573 -0.023578 -2.83386
H  2.409213 -1.23093 -2.867349
elementType: Cl P O N C H
totalener: -1625.17688435 hartree
nucrepener: 1875.09481018 hartree
electener: -3500.27169453 hartree
oneelecener: -5963.91821098 hartree
twoeener: 2463.64651645 hartree
cpcmener: -0.03400321 hartree
kineticenergy: 1620.10741368 hartree
xcener: -115.230403940276 hartree
chargesum: -0.0000000
charge: -0.076707 0.933974 -0.342975 -0.513688 -0.332729 -0.344767 -0.612541 -0.081336 -0.044390 -0.049145 0.313558 -0.256549 -0.262966 -0.000789 0.124080 -0.230923 -0.107355 -0.124186 0.096281 0.093741 0.103290 0.099026 0.099919 0.080461 0.087963 0.091655 0.087037 0.099655 0.114841 0.095435 0.112371 0.133379 0.125473 0.113355 0.128944 0.125117 0.121489
qa: -0.0767 0.9340 -0.3430 -0.5137 -0.3327 -0.3448 -0.6125 -0.0813 -0.0444 -0.0491 0.3136 -0.2565 -0.2630 -0.0008 0.1241 -0.2309 -0.1074 -0.1242 0.0963 0.0937 0.1033 0.0990 0.0999 0.0805 0.0880 0.0917 0.0870 0.0997 0.1148 0.0954 0.1124 0.1334 0.1255 0.1134 0.1289 0.1251 0.1215
va: 1.2452 5.5681 2.0618 1.9890 2.0868 2.1023 2.0008 3.1825 3.8540 3.9064 4.1698 3.9136 3.8979 3.9608 3.8237 3.9601 3.8378 3.8471 1.0001 1.0134 0.9982 0.9979 1.0086 1.0146 1.0022 0.9985 1.0122 1.0087 1.0028 1.0235 1.0013 0.9919 0.9909 0.9929 0.9887 0.9955 0.9877
dispcorr: -0.021298251 hartree
energy: -1625.198182605523
dipole: -3.20724 2.75236 -0.45489 10.45461 -11.91050 -1.45589 -14.95799 13.30301 -1.65498
magnitude: 2.25066 au
magnitude: 5.72073 debye
