program: Orca
programVersion: 5.0.2
elementType: Cl P O O O O O N C C C C C C C C C C H H H H H H H H H H H H H H H H H H H
charge: 0
multiplicity: 1
keywords: wb97x-d3
keywords: def2-TZVPP
keywords: def2/J RIJCOSX
keywords: DEFGRID2
keywords: scfconv7
keywords: smallprint printgap noloewdin
keywords: NOSOSCF
formula: C10H19ClNO5P
InChI: InChI=1/C10H19ClNO5P/c1-6-12(7-2)10(13)9(11)8(3)17-18(14,15-4)16-5/h6-7H2,1-5H3
37 atoms
Cl -2.47375 -1.814601 -1.042817
P  2.528618 -0.571227 0.260063
O  0.906734 -0.41874 0.348349
O  -0.85145 1.239142 -1.620603
O  2.875329 -0.553739 -1.27978
O  2.946107 0.882562 0.752052
O  3.077914 -1.718059 0.986881
N  -2.199799 1.259682 0.188445
C  -2.447942 2.683349 0.025628
C  -2.746648 0.62552 1.372705
C  -1.377512 0.653237 -0.69474
C  -1.362501 3.546908 0.649946
C  -4.242907 0.365627 1.28792
C  -1.156573 -0.823581 -0.519531
C  -0.006164 -1.341342 -0.089919
C  0.338369 -2.786315 0.010077
C  2.507459 0.501513 -2.173163
C  2.991724 1.195047 2.139061
H  -2.542068 2.907743 -1.03571
H  -3.414068 2.906963 0.480684
H  -2.218237 -0.308819 1.555548
H  -2.528837 1.264903 2.233706
H  -1.252012 3.343161 1.715834
H  -0.40333 3.373153 0.165931
H  -1.609347 4.603106 0.54001
H  -4.477162 -0.303922 0.462805
H  -4.594236 -0.096857 2.210417
H  -4.810698 1.286082 1.149314
H  -0.525215 -3.405946 -0.210962
H  1.128723 -3.053015 -0.693675
H  0.703693 -3.031211 1.006291
H  2.799799 0.173879 -3.167386
H  3.044041 1.417903 -1.929089
H  1.435106 0.691287 -2.158766
H  3.519895 0.427542 2.704962
H  1.986238 1.314667 2.545348
H  3.52379 2.138293 2.234475
totalener: -1625.15680054 hartree
nucrepener: 1836.29018727 hartree
electener: -3461.44698781 hartree
oneelecener: -5884.99296404 hartree
twoeener: 2423.54597624 hartree
kineticenergy: 1620.15517797 hartree
xcener: -115.235259514069 hartree
chargesum: -0.0000000
charge: -0.082480 0.855025 -0.311465 -0.428898 -0.315708 -0.330075 -0.504999 -0.115930 -0.040368 -0.091027 0.328505 -0.244102 -0.213565 -0.004718 0.082882 -0.207501 -0.130295 -0.128043 0.094783 0.083392 0.106869 0.086640 0.062465 0.099320 0.087429 0.082447 0.083181 0.073401 0.088027 0.110784 0.113576 0.112457 0.108309 0.143246 0.122809 0.108030 0.115595
qa: -0.0825 0.8550 -0.3115 -0.4289 -0.3157 -0.3301 -0.5050 -0.1159 -0.0404 -0.0910 0.3285 -0.2441 -0.2136 -0.0047 0.0829 -0.2075 -0.1303 -0.1280 0.0948 0.0834 0.1069 0.0866 0.0625 0.0993 0.0874 0.0824 0.0832 0.0734 0.0880 0.1108 0.1136 0.1125 0.1083 0.1432 0.1228 0.1080 0.1156
va: 1.2403 5.6458 2.0883 2.0660 2.1169 2.1040 2.1273 3.1603 3.8919 3.9423 4.1383 3.9207 3.8951 3.8469 3.9152 3.9426 3.8263 3.8719 1.0176 0.9986 0.9966 0.9945 1.0067 1.0120 1.0096 1.0220 1.0111 1.0084 1.0247 1.0059 1.0128 0.9915 0.9957 1.0013 0.9967 0.9879 0.9902
dispcorr: -0.019304640 hartree
energy: -1625.176105175814
dipole: -8.55804 7.64860 -0.90944 17.74190 -16.67486 1.06704 10.63559 -9.66898 0.96661
magnitude: 1.70293 au
magnitude: 4.32850 debye
