program: Gaussian 09
title: 000058868
version: EM64L-G09RevD.01
frameworkgroup: C1[X(C21H25NO3)]
method: RPBEPBE
basis: SDD
operation: Freq
keyword: #p
keyword: freq=noraman
keyword: PBEPBE/SDD
title: #p freq=noraman PBEPBE/SDD
converged: YES YES NO NO
title: Mulliken charges:
elementType: O O O N C C C C C C C C C C C C C C C C C C C C C H H H H H H H H H H H H H H H H H H H H H H H H H
charge: -0.275481 -0.481221 -0.258813 -0.053916 0.038771 -0.413378 -0.436326 -0.400581 -0.397474 0.040567 -0.617270 0.171521 -0.594916 0.376507 0.466278 -0.400946 -0.365479 -0.415058 -0.376000 -0.220457 -0.246081 -0.241801 -0.231790 -0.231904 -0.246109 0.239297 0.233443 0.219472 0.219441 0.213998 0.222858 0.183489 0.180595 0.222453 0.226555 0.225134 0.189572 0.240883 0.236758 0.373600 0.285671 0.251905 0.223885 0.273051 0.225896 0.224794 0.227711 0.222309 0.223154 0.225437
chargesum: 0.00000
title: Mulliken charges with hydrogens summed into heavy atoms:
elementType: O O O N C C C C C C C C C C C C C C C C C C C C C
charge: -0.275481 -0.107621 -0.258813 -0.053916 0.278067 0.039537 -0.002887 0.005766 0.005574 0.040567 0.023991 0.171521 -0.117276 0.376507 0.466278 -0.115275 -0.113574 -0.191174 -0.102950 0.005439 -0.021287 -0.014091 -0.009480 -0.008750 -0.020672
polarizability: 2.43465250e+02 -2.07828334e+01 2.78001962e+02 3.32372302e+01 1.49344102e+01 1.82456489e+02
1716.lowfreq: -1.9548 -0.0006 0.0002 0.0006 3.2185 8.0416 19.5843 32.8945 35.9808
frequency: 19.5836 32.8756 35.5256 43.2930 46.0433 60.0209 78.4868 80.8711 87.9355 133.3758 142.1333 177.2207 214.0548 216.2264 229.2330 244.8480 248.1178 253.9896 302.7924 306.2074 338.7051 349.9836 367.5447 369.8737 404.9900 408.1733 414.9929 440.3872 451.5139 459.6091 479.3383 486.7274 514.1173 550.5601 595.5661 610.5101 616.0521 618.6257 642.0325 698.4908 706.3815 712.6037 743.5865 748.3696 768.9620 791.5750 811.5495 818.9608 840.3007 855.5726 862.7403 877.7336 905.9936 918.1952 928.1641 936.5073 945.5462 977.0984 982.0805 985.8736 990.4878 990.8762 993.8337 1001.1468 1002.5516 1018.4455 1027.9315 1029.8456 1031.2871 1042.7226 1069.4215 1079.9623 1089.8387 1092.7020 1126.0202 1132.1352 1144.0317 1147.9028 1164.0062 1170.1140 1171.0101 1178.4541 1187.5377 1190.7903 1208.6085 1214.8084 1236.3148 1261.5264 1272.7701 1276.7775 1302.3357 1307.8460 1309.3426 1314.6755 1332.0687 1339.2581 1351.5773 1358.0716 1363.8359 1376.8288 1380.0846 1383.3761 1432.3775 1434.2096 1440.0878 1451.4463 1456.5057 1463.5522 1465.3465 1465.9274 1476.2354 1480.6915 1483.0437 1483.2688 1589.7478 1591.2661 1594.2947 1609.1241 1613.6148 2821.0694 2830.5872 2861.9202 3005.5058 3010.2170 3010.4060 3018.8227 3020.6676 3032.9871 3038.1103 3073.2406 3078.3705 3078.9181 3082.5020 3114.4908 3122.6505 3124.9177 3133.7042 3137.4492 3149.5353 3154.1486 3161.1797 3168.0501 3175.7754 3427.6495
redmass: 4.8202 4.4922 3.3092 3.6398 4.1313 4.4586 4.2981 7.6178 4.3195 4.2832 5.4367 4.2643 1.6829 3.1132 2.7648 2.1045 2.9082 4.1597 3.5209 5.9526 2.6137 2.3871 2.6406 3.5951 2.6582 2.8718 4.6107 2.0615 1.7935 1.8877 3.3319 3.4498 3.5347 5.1081 4.4531 3.2734 6.3143 6.1511 5.3845 5.7960 1.8782 1.7752 3.3175 2.0194 2.3784 3.6768 4.0667 1.4569 2.6160 1.2444 1.2425 2.6996 2.3555 2.0836 1.8095 1.4221 3.6630 1.3827 1.4335 1.5988 4.5294 4.2391 1.3663 2.0558 1.4953 2.7520 2.2424 2.1486 2.3474 3.3659 1.6802 1.5885 1.5468 1.6678 1.9487 2.0061 1.4188 2.0153 2.9403 1.1967 1.0568 2.2263 1.1174 1.1838 1.5884 2.5444 1.6141 1.3633 1.9172 1.4329 1.4088 1.2974 1.2953 1.3406 1.2748 1.3759 1.4316 1.4910 1.6407 1.4082 8.0324 6.7389 2.2131 1.1748 2.0468 1.0923 1.1594 1.0739 1.0927 1.0569 2.1452 1.0980 2.2850 1.0638 6.2413 6.0606 9.7501 6.2257 6.1369 1.0717 1.0693 1.0574 1.0605 1.0617 1.0641 1.0823 1.0729 1.0858 1.0871 1.1037 1.1003 1.1010 1.1040 1.0856 1.0848 1.0875 1.0892 1.0935 1.0936 1.0970 1.0978 1.0983 1.0957 1.0646
irintensity: 0.2609 0.0882 0.4606 0.2383 0.1887 0.4299 0.4764 0.4626 0.1866 1.0045 0.9236 0.6958 1.1098 0.5375 3.6381 1.8422 0.2239 3.8571 4.1898 13.6079 7.8354 4.4240 12.1546 23.2785 5.3064 0.2470 6.3415 19.7003 48.4245 28.1336 1.2917 3.1389 6.6248 29.3891 25.9368 2.0391 0.1619 1.0992 14.9550 6.9734 28.3988 99.3806 15.3980 3.9349 39.4760 18.8353 0.7385 0.5716 8.4393 1.0312 0.4502 8.8755 35.0455 9.9778 5.9304 4.6765 10.6778 2.4994 4.7237 0.6314 0.0434 0.6299 1.6442 34.0504 21.3910 43.9956 14.8607 10.8855 12.2992 75.6991 21.5052 14.4986 20.4183 35.0036 6.4048 6.3551 2.2044 3.1443 213.2377 57.4378 1.1675 75.8271 2.5612 2.9721 1.9231 2.1189 66.6967 4.2029 22.2833 14.1318 17.1308 3.0607 2.6689 3.4574 2.1004 0.8494 5.7496 13.2382 40.5761 0.5806 1.5065 0.4858 12.6860 2.0110 5.2232 8.1547 11.5531 10.4618 7.5355 17.9034 28.9684 10.8145 23.2173 7.8485 0.2580 2.3702 116.1926 12.5341 6.8051 48.5233 88.4213 197.5390 17.2645 12.9617 12.0129 15.5492 44.4065 57.3984 23.8155 21.2231 7.5272 33.0254 28.0783 7.3634 0.1324 2.4573 14.4727 39.0975 30.9444 31.1737 17.1693 10.6752 12.3786 61.1346
temp: 298.150 k
press: 1.00000 atm
elementType: 8 8 8 7 6 6 6 6 6 6 6 6 6 6 6 6 6 6 6 6 6 6 6 6 6 1 1 1 1 1 1 1 1 1 1 1 1 1 1 1 1 1 1 1 1 1 1 1 1 1
symmnumber: 1
zpe: 1088094.5 jmol-1
zpe.correction: 0.414433 hartree
zpe.thermalcorrener: 0.437661 hartree
zpe.thermalcorrenthalpy: 0.438605 hartree
zpe.thermalcorrgfe: 0.360070 hartree
zpe.sumelectzpe: -1093.804230 hartree
zpe.sumelectthermal: -1093.781003 hartree
zpe.sumelectthermalent: -1093.780058 hartree
zpe.sumelectthermalfe: -1093.858594 hartree
dipole: -3.5422 -0.1733 -0.8412
dipole: 3.6448
quadrupole: -137.8049 -139.0440 -149.9426
quadrupole: -5.4210 2.4572 0.9191
quadrupole: 4.4590 3.2198 -7.6788 -5.4210 2.4572 0.9191
hfenergy: -1094.2186635 hartree
pointgroup: C01 [X(C21H25N1O3)]
dipole: -1.0941556 0.8276922 -0.4171797 debye
polarizability: 236.1888113|16.8769178|281.7501311|34.8219916|-17.5601462|185.984759 unknown
InChI: InChI=1S/C21H25NO3/c1-22-14-12-19(13-15-22)25-20(23)21(24,18-10-6-3-7-11-18)16-17-8-4-2-5-9-17/h2-11,19,24H,12-16H2,1H3
charge 0 multiplicity 1
50 atoms
O  -0.659007 0.223121 -0.095554
O  1.870789 -1.714098 1.688591
O  -0.034978 0.086632 2.144806
N  -4.159808 2.626377 -0.395762
C  -1.626361 1.33969 0.22075
C  -2.955287 0.755558 0.724699
C  -1.814521 2.132023 -1.075841
C  -3.986251 1.894889 0.881515
C  -2.885207 3.223864 -0.857572
C  1.005027 -1.458901 0.538583
C  -5.254056 3.614817 -0.334985
C  0.051938 -0.306658 0.952004
C  1.912237 -1.056455 -0.671948
C  0.184534 -2.729325 0.199389
C  2.661901 0.256306 -0.502727
C  0.422194 -3.922033 0.923552
C  -0.772327 -2.734618 -0.848442
C  2.304412 1.392363 -1.27435
C  3.738046 0.372076 0.416627
C  -0.289172 -5.102369 0.609616
C  -1.48232 -3.914886 -1.159613
C  -1.244379 -5.10427 -0.431909
C  3.000738 2.614593 -1.134606
C  4.432631 1.593711 0.561614
C  4.067886 2.719812 -0.213131
H  -1.157668 1.960028 1.00894
H  -2.80827 0.24316 1.691821
H  -3.333845 0.023624 -0.011836
H  -2.150682 1.448875 -1.877001
H  -0.858592 2.59282 -1.384932
H  -4.961716 1.469248 1.179692
H  -3.659019 2.582558 1.706969
H  -2.497992 3.982719 -0.125317
H  -3.069253 3.754329 -1.809664
H  -6.19659 3.109185 -0.059101
H  -5.393439 4.076975 -1.328678
H  -5.07275 4.43529 0.405219
H  2.618388 -1.899297 -0.792634
H  1.281575 -1.020559 -1.576414
H  1.491533 -1.206089 2.460813
H  1.170747 -3.905995 1.72034
H  -0.975279 -1.816174 -1.408918
H  1.478198 1.312954 -1.991924
H  4.016919 -0.499659 1.016735
H  -0.094739 -6.019579 1.177234
H  -2.221551 -3.905684 -1.968745
H  -1.796197 -6.019508 -0.674522
H  2.716613 3.479274 -1.74575
H  5.261511 1.666615 1.275189
H  4.61174 3.665073 -0.103723
